{"text_format":"3","workbook":"xlsx","n_sheets":4,"sheets":["EverythingTests","FinanceLibTests","StatsLibTests","misc"],"not_rendered":{"comments":1},"read":"whole","date_system":"1900"}

{"sheet":"EverythingTests","index":0,"n_rows":1504,"n_cols":38,"rows_kept":1504,"merged":[[1,1,3,12],[5,0,20,0],[5,6,5,9],[5,10,5,14],[5,19,5,25],[93,1,93,2]]}
[]
[]
[]
[]
[]
["DATA SECTION","INTEGRAL","DOUBLE","BLANK","STRING","REF","AREA (rows)",{"$nulls":3},"AREA (cols)",{"$nulls":4},"AREA (AREA)",{"$nulls":3},"FINANCE DATA",{"$nulls":6},"ERRORS",{"$nulls":10},"IRR/NPV"]
[null,0,0,null,{"$f":"\"\"","v":""},{"$f":"B7","v":0},1,2,3,4,1,1.001,"alphanum","blanksIncl","E8",1,2,3,4,"r","n","y","p","t","f",null,{"$error":"#NULL!"},null,0,1,2,3,4,5,6,7,8,{"v":-70000,"d":"-70,000"}]
[null,1,1e-05,null,"nospaces",{"$f":"B8","v":1},1.001,2.999,3.5,4.5,2,2.9999,3,null,545,9999.9999,23.3333,{"$f":"2/3","v":"16:00:00"},1000.001,1,10,100,10000,0,null,null,{"$error":"#DIV/0!"},null,8,9,10,11,12,13,14,15,16,{"v":12000,"d":"12,000"}]
[null,2,1.1,null,"sp ace s",{"$f":"B11","v":9999999999},2.3456,3.4567,5.6789,6.789,3,3.5,"ric",345,454,"refsIncl",{"$f":"H7","v":2},{"$f":"I8","v":3.5},{"$f":"E7","v":""},1,10,100,10000,1,null,null,{"$error":"#VALUE!"},null,16,17,18,19,20,21,22,23,24,{"v":15000,"d":"15,000"}]
[null,534,1.00001,null,"endsWithSpace ",{"$f":"C8","v":1e-05},"alphanum",3,"ric","row",4,4.5,"col",1e-05,0,"blanksIncl",null,null,"endarea",2,12,120,12000,0,null,null,{"$error":"#REF!"},null,24,25,26,27,28,29,30,31,32,{"v":18000,"d":"18,000"}]
[null,9999999999,2.99999,null," beginsWithSpace",{"$f":"D7","v":0},"blanksIncl",null,345,1e-05,{"$nulls":9},2,12,120,12000,1,null,null,{"$error":"#NAME?"},null,32,33,34,35,36,37,38,39,40,{"v":12000,"d":"12,000"}]
[null,-9999999999,999999.99999,null,"non-numeric",{"$f":"E9","v":"sp ace s"},"E8",545,454,0,{"$nulls":9},0.6666666666666666,23,133.33,34307,0,null,null,{"$error":"#NUM!"},null,40,41,42,43,44,45,46,47,48,{"v":26000,"d":"26,000"}]
[null,-534,-999999.99999,null,{"$f":"\"0\"","v":"0"},{"$f":"E17","v":"2.99999"},{"$nulls":13},0.6666666666666666,23,133.33,34307,1,null,null,{"$error":"#N/A"}]
[null,-2,-2.99999,null,{"$f":"\"0.000001\"","v":"0.000001"},{"$f":"E19","v":"alph4Num3ric"},{"$nulls":13},0,1,100,2300,0]
[null,-1,-1.00001,null,{"$f":"\"1\"","v":"1"},{"$nulls":14},0,1,100,2300,1]
[null,true,-1.1,null,{"$f":"\"1.1\"","v":"1.1"},{"$nulls":14},0,12,120,12000,0]
[null,false,-1e-05,null,{"$f":"\"2.99999\"","v":"2.99999"},{"$nulls":14},0,12,120,12000,1]
[null,{"$f":"\"TRUE\"","v":"TRUE"},null,null,{"$f":"\"99999999\"","v":"99999999"},{"$nulls":14},2.3333,4,334.5,14323.45,0]
[null,{"$f":"\"FALSE\"","v":"FALSE"},null,null,"alph4Num3ric",{"$nulls":14},2.3333,4,334.5,14323.45,1]
[null,null,"2000-12-25",null,null,{"$f":"D7","v":0}]
[]
[]
[null,"Add","FORMULA",{"$f":"0+0","v":0},{"$f":"999999+1.001","v":1000000.001},{"$f":"-8888+8887.9","v":-0.1000000000003638},{"$f":"B9+C9+F10","v":3.10001},{"$f":"B7+C7+D7+F7","v":0},{"$f":"B7+C7+D7+E7","v":{"$error":"#VALUE!"}},{"$f":"D7+D8","v":0},{"$f":"C7+G7:J7","v":{"$error":"#VALUE!"}}]
[null,null,"EXPECTED VALUE",0,1000000.001,-0.1000000000003638,3.10001,0,{"$error":"#VALUE!"},0,{"$error":"#VALUE!"}]
[]
[]
[null,"ConcatEval","FORMULA",{"$f":"0&1","v":"01"},{"$f":"2&\"hello world\"","v":"2hello world"},{"$f":"\"its \"&(2<3)&\" blue\"","v":"its TRUE blue"},{"$f":"F9&B7&D7&E19","v":"99999999990alph4Num3ric"},{"$f":"K7:L10&D7&F7","v":{"$error":"#VALUE!"}},{"$f":"P7:S10&\"test\"","v":{"$error":"#VALUE!"}}]
[null,null,"EXPECTED VALUE","01","2hello world","its TRUE blue","99999999990alph4Num3ric",{"$error":"#VALUE!"},{"$error":"#VALUE!"}]
[]
[]
[null,"DivideEval","FORMULA",{"$f":"0/1","v":0},{"$f":"B11/B12","v":-1},{"$f":"C13/C17","v":99999999999},{"$f":"E10/D7","v":{"$error":"#VALUE!"}},{"$f":"E9/C8","v":{"$error":"#VALUE!"}},{"$f":"C8/D7","v":{"$error":"#DIV/0!"}},{"$f":"F7/E17","v":0},{"$f":"F7/E9","v":{"$error":"#VALUE!"}},{"$f":"E9/E15","v":{"$error":"#VALUE!"}},{"$f":"E17/E15","v":2.99999},{"$f":"E15/C9","v":0.9090909090909091},{"$f":"G7:J7/B8","v":{"$error":"#VALUE!"}},{"$f":"K7:K10/B8","v":{"$error":"#VALUE!"}},{"$f":"P7:S8/B8","v":{"$error":"#VALUE!"}}]
[null,null,"EXPECTED VALUE",0,-1,99999999999,{"$error":"#VALUE!"},{"$error":"#VALUE!"},{"$error":"#DIV/0!"},0,{"$error":"#VALUE!"},{"$error":"#VALUE!"},2.99999,0.9090909090909091,{"$error":"#VALUE!"},{"$error":"#VALUE!"},{"$error":"#VALUE!"}]
[]
[]
[null,"EqualEval","FORMULA",{"$f":"B8=B8","v":true},{"$f":"1000000=999999.99","v":false},{"$f":"1.11111111111111=1.1111111111111","v":false},{"$f":"E8=E8","v":true},{"$f":"E8=E9","v":false},{"$f":"\"1.1\"=C9","v":false},{"$f":"1.1=C16","v":false},{"$f":"-200=200","v":false},{"$f":"\"\"=D7","v":true},{"$f":"0=D7","v":true},{"$f":"FALSE=D7","v":true},{"$f":"\"\"=0","v":false},{"$f":"FALSE=0","v":false}]
[null,null,"EXPECTED VALUE",true,false,false,true,false,false,false,false,true,true,true,false,false]
[]
[]
[null,"GreaterEqualEval","FORMULA",{"$f":"2>=2","v":true},{"$f":"B11>=C12","v":true},{"$f":"C10>=1.00001","v":true},{"$f":"D7>=D8","v":true},{"$f":"E8>=E10","v":true},{"$f":"E10>=E8","v":false},{"$f":"F9>=F9","v":true},{"$f":"G7:J7>=G7:J7","v":{"$error":"#VALUE!"}},{"$f":"K7:K10>=K7:K10","v":{"$error":"#VALUE!"}}]
[null,null,"EXPECTED VALUE",true,true,true,true,true,false,true,{"$error":"#VALUE!"},{"$error":"#VALUE!"}]
[]
[]
[null,"GreaterThanEval","FORMULA",{"$f":"B7>B11","v":false},{"$f":"B11>B7","v":true},{"$f":"B7>B12","v":true},{"$f":"B13>C15","v":false},{"$f":"D7>C8","v":false},{"$f":"D7>C17","v":true},{"$f":"F14>F13","v":true},{"$f":"E15>E9","v":false},{"$f":"G7:J7>F8","v":{"$error":"#VALUE!"}},{"$f":"K7:K10>F11","v":{"$error":"#VALUE!"}},{"$f":"FALSE>\"TRUE\"","v":true},{"$f":"TRUE>\"TRUER\"","v":true}]
[null,null,"EXPECTED VALUE",false,true,true,false,false,true,true,false,{"$error":"#VALUE!"},{"$error":"#VALUE!"},true,true]
[]
[]
[null,"IntersectionEval","FORMULA","Not supported by XSSF"]
[null,null,"EXPECTED VALUE","Not supported by XSSF"]
[]
[]
[null,"LessEqualEval","FORMULA",{"$f":"B7<=C7","v":true},{"$f":"B8<=C9","v":true},{"$f":"C8<=C16","v":false},{"$f":"E8<=E9","v":true},{"$f":"C9<=E11","v":true},{"$f":"F10<=F11","v":false},{"$f":"F12<=E12","v":false},{"$f":"E17<=C11","v":false},{"$f":"G7:J7<=F8","v":{"$error":"#VALUE!"}},{"$f":"L7:L10<=B7","v":{"$error":"#VALUE!"}}]
[null,null,"EXPECTED VALUE",true,true,false,true,true,false,false,false,{"$error":"#VALUE!"},{"$error":"#VALUE!"}]
[]
[]
[null,"LessThanEval","FORMULA",{"$f":"B7<B8","v":true},{"$f":"B8<B7","v":false},{"$f":"C10<C9","v":true},{"$f":"E8<E9","v":true},{"$f":"C9<E16","v":true}]
[null,null,"EXPECTED VALUE",true,false,true,true,true]
[]
[]
[null,"MultiplyEval","FORMULA",{"$f":"1*0","v":0},{"$f":"\"test\"*0","v":{"$error":"#VALUE!"}},{"$f":"1.99999*0.033","v":0.06599967},{"$f":"B10*C11","v":1601.99466},{"$f":"D7*C8","v":0},{"$f":"E7*C7","v":{"$error":"#VALUE!"}},{"$f":"A7:J7*B15","v":-4},{"$f":"K7:K10*B10","v":{"$error":"#VALUE!"}},{"$f":"J1:J59*B8","v":-4},{"$f":"\"\"*\"1\"","v":{"$error":"#VALUE!"}},{"$f":"\"1\"*1","v":1},{"$f":"TRUE*34","v":34},{"$f":"FALSE*2","v":0},{"$f":"B18*B16","v":{"$error":"#VALUE!"}}]
[null,null,"EXPECTED VALUE",0,{"$error":"#VALUE!"},0.06599967,1601.99466,0,{"$error":"#VALUE!"},-4,{"$error":"#VALUE!"},-4,{"$error":"#VALUE!"},1,34,0,{"$error":"#VALUE!"}]
[]
[]
[null,"NotEqualEval","FORMULA",{"$f":"B7<>B7","v":false},{"$f":"\"TRUE\"<>B16","v":true},{"$f":"\"TRUE\"<>B18","v":false},{"$f":"FALSE<>B19","v":true},{"$f":"C8<>0.00001001","v":true},{"$f":"E9<>\"spaces\"","v":true},{"$f":"E11<>\"beginsWithSpace\"","v":true},{"$f":"1<>E15","v":true},{"$f":"E17<>C17","v":true},{"$f":"F14<>F14","v":false},{"$f":"\"blanksIncl\"<>G11","v":false},{"$f":"G7:J7<>G7:J7","v":{"$error":"#VALUE!"}},{"$f":"P7:S8<>P7:S8","v":{"$error":"#VALUE!"}},{"$f":"P7:S7<>Q7:R7","v":false},{"$f":"P7:P10<>S7:S10","v":{"$error":"#VALUE!"}},{"$f":"\"\"<>D7","v":false},{"$f":"0<>D7","v":false}]
[null,null,"EXPECTED VALUE",false,true,false,true,true,true,true,true,true,false,false,{"$error":"#VALUE!"},{"$error":"#VALUE!"},false,{"$error":"#VALUE!"},false,false]
[]
[]
[null,"PercentEval","FORMULA",{"$f":"50%","v":0.5},{"$f":"\"250\"%","v":2.5},{"$f":"B16%","v":0.01},{"$f":"F13%","v":0.0299999},{"$f":"1000%%","v":0.1}]
[null,null,"EXPECTED VALUE",0.5,2.5,0.01,0.0299999,0.1]
[]
[]
[null,"PowerEval","FORMULA",{"$f":"2^5","v":32},{"$f":"1^99999","v":1},{"$f":"B13^0","v":1},{"$f":"C15^C9","v":{"$error":"#NUM!"}},{"$f":"B8^C9","v":1},{"$f":"C7^C9","v":0},{"$f":"B9^C9","v":2.1435469250725863},{"$f":"C15^B9","v":1.0000200001000001},{"$f":"B10^B14","v":3.5068523895692182E-6},{"$f":"G10^C7","v":{"$error":"#VALUE!"}},{"$f":"E7^C7","v":{"$error":"#VALUE!"}},{"$f":"H7:J7^C7","v":{"$error":"#VALUE!"}},{"$f":"N7:Q7^Q9","v":1},{"$f":"P7:Q9^R7","v":{"$error":"#VALUE!"}},{"$f":"P70:P71^R9","v":1}]
[null,null,"EXPECTED VALUE",32,1,1,{"$error":"#NUM!"},1,0,2.1435469250725863,1.0000200001000001,3.5068523895692182E-6,{"$error":"#VALUE!"},{"$error":"#VALUE!"},{"$error":"#VALUE!"},1,{"$error":"#VALUE!"},1]
[]
[]
[null,"RangeEval","FORMULA","Not supported by XSSF"]
[null,null,"EXPECTED VALUE","Not supported by XSSF"]
[]
[]
[null,"SubtractEval","FORMULA",{"$f":"B10-C9","v":532.9},{"$f":"9999-9999","v":0},{"$f":"C9-C16","v":2.2},{"$f":"D8-D7","v":0},{"$f":"D7-C9","v":-1.1},{"$f":"E7-C7","v":{"$error":"#VALUE!"}},{"$f":"B16-B17","v":1},{"$f":"B19-B18","v":{"$error":"#VALUE!"}},{"$f":"B17-B16","v":-1},{"$f":"M7:M10-N7:N10","v":{"$error":"#VALUE!"}},{"$f":"L10:O10-N9","v":-344.99999},{"$f":"N10:P10-O8:O11","v":{"$error":"#VALUE!"}},{"$f":"I7-M9","v":{"$error":"#VALUE!"}}]
[null,null,"EXPECTED VALUE",532.9,0,2.2,0,-1.1,{"$error":"#VALUE!"},1,{"$error":"#VALUE!"},-1,{"$error":"#VALUE!"},-344.99999,{"$error":"#VALUE!"},{"$error":"#VALUE!"}]
[]
[]
[null,"UnaryMinusEval","FORMULA",{"$f":"-B9","v":-2},{"$f":"-B12","v":9999999999},{"$f":"-B16","v":-1},{"$f":"-F10:H10","v":{"$error":"#VALUE!"}},{"$f":"-G11:I11","v":0},{"$f":"-H10:J10","v":{"$error":"#VALUE!"}},{"$f":"-E7","v":{"$error":"#VALUE!"}},{"$f":"-F10","v":-1e-05},{"$f":"-K7:L8","v":{"$error":"#VALUE!"}},{"$f":"-M7:M10","v":{"$error":"#VALUE!"}},{"$f":"-K10","v":-4},{"$f":"-B18","v":{"$error":"#VALUE!"}}]
[null,null,"EXPECTED VALUE",-2,9999999999,-1,{"$error":"#VALUE!"},0,{"$error":"#VALUE!"},{"$error":"#VALUE!"},-1e-05,{"$error":"#VALUE!"},{"$error":"#VALUE!"},-4,{"$error":"#VALUE!"}]
[]
[]
[null,"UnaryPlusEval","FORMULA",{"$f":"2","v":2},{"$f":"+C14","v":-2.99999},{"$f":"+D7","v":0},{"$f":"+F9:H9","v":2.3456},{"$f":"+G85:G87","v":2.3456},{"$f":"+H12:J12","v":454},{"$f":"+I7:J8","v":{"$error":"#VALUE!"}},{"$f":"+J11:L11","v":0},{"$f":"+E7","v":""},{"$f":"+L10:N10","v":"col"},{"$f":"-\"hello\"","v":{"$error":"#VALUE!"}}]
[null,null,"EXPECTED VALUE",2,-2.99999,0,2.3456,2.3456,454,{"$error":"#VALUE!"},0,"","col",{"$error":"#VALUE!"}]
[]
[]
[null,"<END-OF-FUNCTIONS>"]
[]
[]
[null,"Excel functions"]
[]
[null,"Abs","FORMULA",{"$f":"ABS(B7)","v":0},{"$f":"ABS(B12)","v":9999999999},{"$f":"ABS(C14)","v":2.99999},{"$f":"ABS(D7)","v":0},{"$f":"ABS(E7)","v":{"$error":"#VALUE!"}},{"$f":"ABS(\"1\")","v":1},{"$f":"ABS(F10)","v":1e-05},{"$f":"ABS(F13)","v":2.99999},{"$f":"ABS(G7:G12)","v":{"$error":"#VALUE!"}},{"$f":"ABS(K7:N7)","v":{"$error":"#VALUE!"}},{"$f":"ABS(K9:N9)","v":345},{"$f":"ABS(N88:N96)","v":345},{"$f":"ABS(B18)","v":{"$error":"#VALUE!"}},{"$f":"ABS(B16)","v":1},{"$f":"ABS(B17)","v":0}]
[null,null,"EXPECTED VALUE",0,9999999999,2.99999,0,{"$error":"#VALUE!"},1,1e-05,2.99999,{"$error":"#VALUE!"},{"$error":"#VALUE!"},345,345,{"$error":"#VALUE!"},1,0]
[]
[]
[null,"Absref","FORMULA"]
[null,null,"EXPECTED VALUE"]
[]
[]
[null,"Acos","FORMULA",{"$f":"ACOS(0)","v":1.5707963267948966},{"$f":"ACOS(B9)","v":{"$error":"#NUM!"}},{"$f":"ACOS(B7)","v":1.5707963267948966},{"$f":"ACOS(B16)","v":0},{"$f":"ACOS(B17)","v":1.5707963267948966},{"$f":"ACOS(C17)","v":1.5708063267948966},{"$f":"ACOS(D7)","v":1.5707963267948966},{"$f":"ACOS(E7)","v":{"$error":"#VALUE!"}},{"$f":"ACOS(F8)","v":0},{"$f":"ACOS(G9)","v":{"$error":"#NUM!"}},{"$f":"ACOS(K8:N8)","v":1.5707963267948966},{"$f":"ACOS(L102:L105)","v":1.5707963267948966},{"$f":"ACOS(O7:P8)","v":{"$error":"#VALUE!"}},{"$f":"ACOS(\"0.5\")","v":1.0471975511965976}]
[null,null,"EXPECTED VALUE",1.5707963267948966,{"$error":"#NUM!"},1.5707963267948966,0,1.5707963267948966,1.5708063267948966,1.5707963267948966,{"$error":"#VALUE!"},0,{"$error":"#NUM!"},1.5707963267948966,1.5707963267948966,{"$error":"#VALUE!"},1.0471975511965976]
[]
[]
[null,"Acosh","FORMULA",{"$f":"ACOSH(B9)","v":1.3169578969248166},{"$f":"ACOSH(B12)","v":{"$error":"#NUM!"}},{"$f":"ACOSH(B13)","v":{"$error":"#NUM!"}},{"$f":"ACOSH(B16)","v":0},{"$f":"ACOSH(B18)","v":{"$error":"#VALUE!"}},{"$f":"ACOSH(D7)","v":{"$error":"#NUM!"}},{"$f":"ACOSH(C7)","v":{"$error":"#NUM!"}},{"$f":"ACOSH(C14)","v":{"$error":"#NUM!"}},{"$f":"ACOSH(E14)","v":{"$error":"#NUM!"}},{"$f":"ACOSH(K8:N8)","v":1.762747174039086},{"$f":"ACOSH(M106:M109)","v":1.1676387512082018},{"$f":"ACOSH(N9:O10)","v":{"$error":"#VALUE!"}}]
[null,null,"EXPECTED VALUE",1.3169578969248166,{"$error":"#NUM!"},{"$error":"#NUM!"},0,{"$error":"#VALUE!"},{"$error":"#NUM!"},{"$error":"#NUM!"},{"$error":"#NUM!"},{"$error":"#NUM!"},1.762747174039086,1.1676387512082018,{"$error":"#VALUE!"}]
[]
[]
[null,"Activecell","FORMULA"]
[null,null,"EXPECTED VALUE"]
[]
[]
[null,"Addbar","FORMULA","WILL_NEVER_IMPLEMENT"]
[null,null,"EXPECTED VALUE","WILL_NEVER_IMPLEMENT"]
[]
[]
[null,"Addcommand","FORMULA","WILL_NEVER_IMPLEMENT"]
[null,null,"EXPECTED VALUE","WILL_NEVER_IMPLEMENT"]
[]
[]
[null,"Addmenu","FORMULA","WILL_NEVER_IMPLEMENT"]
[null,null,"EXPECTED VALUE","WILL_NEVER_IMPLEMENT"]
[]
[]
[null,"Address","FORMULA",{"$f":"ADDRESS(2,3)","v":"$C$2"},{"$f":"ADDRESS(2,3,2)","v":"C$2"},{"$f":"ADDRESS(2,3,3,TRUE,\"[Book1]Sheet1\")","v":"[Book1]Sheet1!$C2"}]
[null,null,"EXPECTED VALUE","$C$2","C$2","'[Book1]Sheet1'!$C2"]
[]
[]
[null,"Addtoolbar","FORMULA","WILL_NEVER_IMPLEMENT"]
[null,null,"EXPECTED VALUE","WILL_NEVER_IMPLEMENT"]
[]
[]
[null,"And","FORMULA",{"$f":"AND(B7:B9,C9,D7,E7)","v":false},{"$f":"AND(C9,B15)","v":true},{"$f":"AND(E7)","v":{"$error":"#VALUE!"}},{"$f":"AND(B7:E10)","v":false},{"$f":"AND(F12:I12)","v":true},{"$f":"AND(E14,E17,\"1\")","v":{"$error":"#VALUE!"}},{"$f":"AND(\"1\",1)","v":{"$error":"#VALUE!"}},{"$f":"AND(E15,G13)","v":{"$error":"#VALUE!"}},{"$f":"AND(E15:E17,C13:C15,B9:B10)","v":true},{"$f":"AND(B16:B17)","v":false},{"$f":"AND(B15:B16)","v":true},{"$f":"AND(B17:B18)","v":false},{"$f":"AND(B18:B19)","v":{"$error":"#VALUE!"}}]
[null,null,"EXPECTED VALUE",false,true,{"$error":"#VALUE!"},false,true,{"$error":"#VALUE!"},{"$error":"#VALUE!"},{"$error":"#VALUE!"},true,false,true,false,{"$error":"#VALUE!"}]
[]
[]
[null,"Apptitle","FORMULA","WILL_NEVER_IMPLEMENT"]
[null,null,"EXPECTED VALUE","WILL_NEVER_IMPLEMENT"]
[]
[]
[null,"Areas","FORMULA"]
[null,null,"EXPECTED VALUE"]
[]
[]
[null,"Argument","FORMULA"]
[null,null,"EXPECTED VALUE"]
[]
[]
[null,"Asc","FORMULA"]
[null,null,"EXPECTED VALUE"]
[]
[]
[null,"Asin","FORMULA",{"$f":"ASIN(B7)","v":0},{"$f":"ASIN(C8)","v":1.0000000000166668E-5},{"$f":"ASIN(B10)","v":{"$error":"#NUM!"}},{"$f":"ASIN(B13)","v":{"$error":"#NUM!"}},{"$f":"ASIN(B17)","v":0},{"$f":"ASIN(B16)","v":1.5707963267948966},{"$f":"ASIN(D7)","v":0},{"$f":"ASIN(E7)","v":{"$error":"#VALUE!"}},{"$f":"ASIN(F8)","v":1.5707963267948966},{"$f":"ASIN(I11:M11)","v":0},{"$f":"ASIN(H12:J12)","v":{"$error":"#VALUE!"}},{"$f":"ASIN(M154:M157)","v":0},{"$f":"ASIN(\"1\")","v":1.5707963267948966}]
[null,null,"EXPECTED VALUE",0,1.0000000000166668E-5,{"$error":"#NUM!"},{"$error":"#NUM!"},0,1.5707963267948966,0,{"$error":"#VALUE!"},1.5707963267948966,0,{"$error":"#VALUE!"},0,1.5707963267948966]
[]
[]
[null,"Asinh","FORMULA",{"$f":"ASINH(B7)","v":0},{"$f":"ASINH(B8)","v":0.8813735870195429},{"$f":"ASINH(B11)","v":23.718998110400403},{"$f":"ASINH(B13)","v":-6.973543896232084},{"$f":"ASINH(B16)","v":0.8813735870195429},{"$f":"ASINH(D7)","v":0},{"$f":"ASINH(E7)","v":{"$error":"#VALUE!"}},{"$f":"ASINH(\"\")","v":{"$error":"#VALUE!"}},{"$f":"ASINH(\"1\")","v":0.8813735870195429},{"$f":"ASINH(J10:M10)","v":{"$error":"#VALUE!"}},{"$f":"ASINH(L11:O11)","v":0},{"$f":"ASINH(L158:L161)","v":0.7949577687638787},{"$f":"ASINH(O9:P11)","v":{"$error":"#VALUE!"}}]
[null,null,"EXPECTED VALUE",0,0.8813735870195429,23.718998110400403,-6.973543896231125,0.8813735870195429,0,{"$error":"#VALUE!"},{"$error":"#VALUE!"},0.8813735870195429,{"$error":"#VALUE!"},0,0.7949577687638787,{"$error":"#VALUE!"}]
[]
[]
[null,"Atan","FORMULA",{"$f":"ATAN(B7)","v":0},{"$f":"ATAN(B10)","v":1.5689236698079085},{"$f":"ATAN(B16)","v":0.7853981633974483},{"$f":"ATAN(D7)","v":0},{"$f":"ATAN(E7)","v":{"$error":"#VALUE!"}},{"$f":"ATAN(E15)","v":0.7853981633974483},{"$f":"ATAN(\"1\")","v":0.7853981633974483},{"$f":"ATAN(F12)","v":{"$error":"#VALUE!"}},{"$f":"ATAN(F10)","v":9.9999999996666679E-6},{"$f":"ATAN(K10:N10)","v":{"$error":"#VALUE!"}},{"$f":"ATAN(L11:N11)","v":0},{"$f":"ATAN(N162:N165)","v":0},{"$f":"ATAN(O7:P8)","v":{"$error":"#VALUE!"}}]
[null,null,"EXPECTED VALUE",0,1.5689236698079085,0.7853981633974483,0,{"$error":"#VALUE!"},0.7853981633974483,0.7853981633974483,{"$error":"#VALUE!"},9.9999999996666679E-6,{"$error":"#VALUE!"},0,0,{"$error":"#VALUE!"}]
[]
[]
[null,"Atan2","FORMULA",{"$f":"ATAN2(B7,B7)","v":{"$error":"#DIV/0!"}},{"$f":"ATAN2(B7,B8)","v":1.5707963267948966},{"$f":"ATAN2(B12,C9)","v":3.141592653479793},{"$f":"ATAN2(B15,B16)","v":2.356194490192345},{"$f":"ATAN2(B18,B16)","v":{"$error":"#VALUE!"}},{"$f":"ATAN2(G12:I12,J9)","v":0.014952630018344298},{"$f":"ATAN2(I167:I169,I11:K11)","v":6.6877856917807108E-4},{"$f":"ATAN2(K7:K8,J9:K9)","v":{"$error":"#VALUE!"}},{"$f":"ATAN2(K9:L10,2)","v":{"$error":"#VALUE!"}},{"$f":"ATAN2(\"1\",TRUE)","v":0.7853981633974483},{"$f":"ATAN2(1,0)","v":0},{"$f":"ATAN2(#N/A,#NAME?)","v":{"$error":"#N/A"}}]
[null,null,"EXPECTED VALUE",{"$error":"#DIV/0!"},1.5707963267948966,3.141592653479793,2.356194490192345,{"$error":"#VALUE!"},0.014952630018344298,6.6877856917807108E-4,{"$error":"#VALUE!"},{"$error":"#VALUE!"},0.7853981633974483,0,{"$error":"#N/A"}]
[]
[]
[null,"Atanh","FORMULA",{"$f":"ATANH(B7)","v":0},{"$f":"ATANH(C9)","v":{"$error":"#NUM!"}},{"$f":"ATANH(B13)","v":{"$error":"#NUM!"}},{"$f":"ATANH(B16)","v":{"$error":"#NUM!"}},{"$f":"ATANH(B17)","v":0},{"$f":"ATANH(E7)","v":{"$error":"#VALUE!"}},{"$f":"ATANH(F12)","v":{"$error":"#VALUE!"}},{"$f":"ATANH(K7:M7)","v":{"$error":"#NUM!"}},{"$f":"ATANH(K11:M11)","v":0},{"$f":"ATANH(L171:L173)","v":0},{"$f":"ATANH(M9:O10)","v":{"$error":"#VALUE!"}}]
[null,null,"EXPECTED VALUE",0,{"$error":"#NUM!"},{"$error":"#NUM!"},{"$error":"#NUM!"},0,{"$error":"#VALUE!"},{"$error":"#VALUE!"},{"$error":"#NUM!"},0,0,{"$error":"#VALUE!"}]
[]
[]
[null,"Avedev","FORMULA",{"$f":"AVEDEV(B7:C7,C11,B16:B17)","v":1.3333288888888888},{"$f":"AVEDEV(C7:D9)","v":0.4888866666666667},{"$f":"AVEDEV(D7:E9)","v":{"$error":"#NUM!"}},{"$f":"AVEDEV(E13:E17)","v":{"$error":"#NUM!"}},{"$f":"AVEDEV(C7:E11)","v":0.8239943999999999},{"$f":"AVEDEV(C7:C11)","v":0.8239943999999999},{"$f":"AVEDEV(F8:H10)","v":2187499999.349928},{"$f":"AVEDEV(H7:J10)","v":1.079692},{"$f":"AVEDEV(TRUE, FALSE)","v":0.5}]
[null,null,"EXPECTED VALUE",1.3333288888888888,0.4888866666666667,{"$error":"#NUM!"},{"$error":"#NUM!"},0.8239943999999999,0.8239943999999999,2187499999.349928,1.079692,0.5]
[]
[]
[null,"Average","FORMULA",{"$f":"AVERAGE(B7:C15,B16:C17,D8:D16)","v":-4.0893554731909327E-9},{"$f":"AVERAGE(D7:D15)","v":{"$error":"#DIV/0!"}},{"$f":"AVERAGE(D9:E16)","v":{"$error":"#DIV/0!"}},{"$f":"AVERAGE(\"1\",B8:B9)","v":1.3333333333333333},{"$f":"AVERAGE(F11,G8)","v":0.5005},{"$f":"AVERAGE(F8:H10)","v":1250000001.6002886},{"$f":"AVERAGE(TRUE, FALSE)","v":0.5}]
[null,null,"EXPECTED VALUE",-4.0893554731909327E-9,{"$error":"#DIV/0!"},{"$error":"#DIV/0!"},1.3333333333333333,0.5005,1250000001.6002886,0.5]
[]
[]
[null,"Averagea","FORMULA"]
[null,null,"EXPECTED VALUE"]
[]
[]
[null,"Betadist","FORMULA"]
[null,null,"EXPECTED VALUE"]
[]
[]
[null,"Betainv","FORMULA"]
[null,null,"EXPECTED VALUE"]
[]
[]
[null,"Binomdist","FORMULA"]
[null,null,"EXPECTED VALUE"]
[]
[]
[null,"Call","FORMULA","WILL_NEVER_IMPLEMENT"]
[null,null,"EXPECTED VALUE","WILL_NEVER_IMPLEMENT"]
[]
[]
[null,"Caller","FORMULA","WILL_NEVER_IMPLEMENT"]
[null,null,"EXPECTED VALUE","WILL_NEVER_IMPLEMENT"]
[]
[]
[null,"Cancelkey","FORMULA"]
[null,null,"EXPECTED VALUE"]
[]
[]
[null,"Ceiling","FORMULA",{"$f":"CEILING(B10,B9)","v":534},{"$f":"CEILING(C11,C9)","v":3.3000000000000003},{"$f":"CEILING(D9,D10)","v":0},{"$f":"CEILING(C12,D11)","v":0},{"$f":"CEILING(E17,E15)","v":3},{"$f":"CEILING(F13,F10)","v":2.9999900000000004},{"$f":"CEILING(I9:J9,H210:H213)","v":9},{"$f":"CEILING(J8:K9,1)","v":{"$error":"#VALUE!"}},{"$f":"CEILING(G10,G7)","v":{"$error":"#VALUE!"}},{"$f":"CEILING(0,0)","v":0}]
[null,null,"EXPECTED VALUE",534,3.3,0,0,3,2.9999900000000004,9,{"$error":"#VALUE!"},{"$error":"#VALUE!"},0]
[]
[]
[null,"Cell","FORMULA"]
[null,null,"EXPECTED VALUE"]
[]
[]
[null,"Char","FORMULA",{"$f":"CHAR(65)","v":"A"},{"$f":"CHAR(33)","v":"!"},{"$f":"CHAR(-1)","v":{"$error":"#VALUE!"}}]
[null,null,"EXPECTED VALUE","A","!",{"$error":"#VALUE!"}]
[]
[]
[null,"Checkcommand","FORMULA","WILL_NEVER_IMPLEMENT"]
[null,null,"EXPECTED VALUE","WILL_NEVER_IMPLEMENT"]
[]
[]
[null,"Chidist","FORMULA"]
[null,null,"EXPECTED VALUE"]
[]
[]
[null,"Chiinv","FORMULA"]
[null,null,"EXPECTED VALUE"]
[]
[]
[null,"Chitest","FORMULA"]
[null,null,"EXPECTED VALUE"]
[]
[]
[null,"Choose","FORMULA",{"$f":"CHOOSE(1,2,3)","v":2},{"$f":"CHOOSE(#REF!, 1)","v":{"$error":"#REF!"}},{"$f":"CHOOSE(2,#N/A,#NULL!)","v":{"$error":"#NULL!"}},{"$f":"CHOOSE(2,#REF!,3)","v":3},{"$f":"CHOOSE(1.9,5,6)","v":5}]
[null,null,"EXPECTED VALUE",2,{"$error":"#REF!"},{"$error":"#NULL!"},3,5]
[]
[]
[null,"Clean","FORMULA",{"$f":"CLEAN(CHAR(7)&\"text\"&CHAR(7))","v":"text"}]
[null,null,"EXPECTED VALUE","text"]
[]
[]
[null,"Code","FORMULA"]
[null,null,"EXPECTED VALUE"]
[]
[]
[null,"Column","FORMULA",{"$f":"COLUMN(C7)","v":3},{"$f":"COLUMN(1:2)","v":1},{"$f":"COLUMN(B7:B11)","v":2},{"$f":"COLUMN(B11:D11)","v":2},{"$f":"COLUMN(E15:G19)","v":5},{"$f":"COLUMN(G17:H21)","v":7}]
[null,null,"EXPECTED VALUE",3,1,2,2,5,7]
[]
[]
[null,"Columns","FORMULA",{"$f":"COLUMNS(C1:E4)","v":3}]
[null,null,"EXPECTED VALUE",3]
[]
[]
[null,"Combin","FORMULA",{"$f":"COMBIN(B9,B8)","v":2},{"$f":"COMBIN(19,7)","v":50388.00000000001},{"$f":"COMBIN(E13:G13,2)","v":1},{"$f":"COMBIN(E13:F13,1)","v":{"$error":"#VALUE!"}},{"$f":"COMBIN(E15,E17)","v":{"$error":"#NUM!"}},{"$f":"COMBIN(C15,C16)","v":{"$error":"#NUM!"}},{"$f":"COMBIN(-23,12)","v":{"$error":"#NUM!"}},{"$f":"COMBIN(99,1)","v":99},{"$f":"COMBIN(23,D259:D261)","v":253}]
[null,null,"EXPECTED VALUE",2,50388,1,{"$error":"#VALUE!"},{"$error":"#NUM!"},{"$error":"#NUM!"},{"$error":"#NUM!"},99,253]
[]
[]
[null,"Concatenate","FORMULA",{"$f":"CONCATENATE(B7,B15)","v":"0-1"},{"$f":"CONCATENATE(B16,B18)","v":"TRUETRUE"},{"$f":"CONCATENATE(C9,D14,B14,B17)","v":"1.1-2FALSE"},{"$f":"CONCATENATE(E9,F12)","v":"sp ace ssp ace s"},{"$f":"CONCATENATE(F13,E16)","v":"2.999991.1"},{"$f":"CONCATENATE(G10:J10,F263:F265)","v":"ric1.1-2FALSE"},{"$f":"CONCATENATE(F13:G15,E16)","v":{"$error":"#VALUE!"}},{"$f":"CONCATENATE(K8:L9,K10)","v":{"$error":"#VALUE!"}}]
[null,null,"EXPECTED VALUE","0-1","TRUETRUE","1.1-2FALSE","sp ace ssp ace s","2.999991.1","ric1.1-2FALSE",{"$error":"#VALUE!"},{"$error":"#VALUE!"}]
[]
[]
[null,"Confidence","FORMULA"]
[null,null,"EXPECTED VALUE"]
[]
[]
[null,"Correl","FORMULA"]
[null,null,"EXPECTED VALUE"]
[]
[]
[null,"Cos","FORMULA",{"$f":"COS(D7)","v":1},{"$f":"COS(E7)","v":{"$error":"#VALUE!"}},{"$f":"COS(E15)","v":0.5403023058681398},{"$f":"COS(\"1\")","v":0.5403023058681398},{"$f":"COS(B16)","v":0.5403023058681398},{"$f":"COS(B17)","v":1},{"$f":"COS(B18)","v":{"$error":"#VALUE!"}},{"$f":"COS(H12:L12)","v":1},{"$f":"COS(K274:K277)","v":0.5403023058681398},{"$f":"COS(F11)","v":1},{"$f":"COS(I8:K8)","v":{"$error":"#VALUE!"}},{"$f":"COS(K8:K10)","v":{"$error":"#VALUE!"}}]
[null,null,"EXPECTED VALUE",1,{"$error":"#VALUE!"},0.5403023058681398,0.5403023058681398,0.5403023058681398,1,{"$error":"#VALUE!"},1,0.5403023058681398,1,{"$error":"#VALUE!"},{"$error":"#VALUE!"}]
[]
[]
[null,"Cosh","FORMULA",{"$f":"COSH(B7)","v":1},{"$f":"COSH(C8)","v":1.00000000005},{"$f":"COSH(B13)","v":4.094711806131958e+231},{"$f":"COSH(B16)","v":1.5430806348152437},{"$f":"COSH(B18)","v":{"$error":"#VALUE!"}},{"$f":"COSH(D8)","v":1},{"$f":"COSH(E7)","v":{"$error":"#VALUE!"}},{"$f":"COSH(E15)","v":1.5430806348152437},{"$f":"COSH(I10:L10)","v":45.014120148530026},{"$f":"COSH(K279:K281)","v":2.4463520074491623},{"$f":"COSH(M8:N9)","v":{"$error":"#VALUE!"}}]
[null,null,"EXPECTED VALUE",1,1.00000000005,4.094711806131958e+231,1.5430806348152437,{"$error":"#VALUE!"},1,{"$error":"#VALUE!"},1.5430806348152437,45.014120148530026,2.4463520074491623,{"$error":"#VALUE!"}]
[]
[]
[null,"Count","FORMULA",{"$f":"COUNT(B8:E9)","v":4},{"$f":"COUNT(E10:F13)","v":2},{"$f":"COUNT(2, \"A\",  \"\",#REF!, #DIV/0!)","v":1}]
[null,null,"EXPECTED VALUE",4,2,1]
[]
[]
[null,"Counta","FORMULA",{"$f":"COUNTA(C9:D11)","v":3},{"$f":"COUNTA(E10:F13)","v":8},{"$f":"COUNTA(2, \"A\",  \"\",#REF!, #DIV/0!)","v":5}]
[null,null,"EXPECTED VALUE",3,8,5]
[]
[]
[null,"Countblank","FORMULA",{"$f":"COUNTBLANK(B8:E9)","v":2},{"$f":"COUNTBLANK(G10:G18)","v":6}]
[null,null,"EXPECTED VALUE",2,6]
[]
[]
[null,"Countif","FORMULA",{"$f":"COUNTIF(J7:K10, 4)","v":2},{"$f":"COUNTIF(AA7:AA13, 1/0)","v":1},{"$f":"COUNTIF(G7:K7,E8:G8)","v":2}]
[null,null,"EXPECTED VALUE",2,1,2]
[]
[]
[null,"Covar","FORMULA"]
[null,null,"EXPECTED VALUE"]
[]
[]
[null,"Createobject","FORMULA","WILL_NEVER_IMPLEMENT"]
[null,null,"EXPECTED VALUE","WILL_NEVER_IMPLEMENT"]
[]
[]
[null,"Critbinom","FORMULA"]
[null,null,"EXPECTED VALUE"]
[]
[]
[null,"Customrepeat","FORMULA"]
[null,null,"EXPECTED VALUE"]
[]
[]
[null,"Customundo","FORMULA","WILL_NEVER_IMPLEMENT"]
[null,null,"EXPECTED VALUE","WILL_NEVER_IMPLEMENT"]
[]
[]
[null,"Date","FORMULA",{"$f":"DATE(1900, 1, 1)","v":1},{"$f":"DATE(1900, 1, 32)","v":32},{"$f":"DATE(1900, 222, 1)","v":6727},{"$f":"DATE(2007, 1, 1)","v":39083},{"$f":"DATE(1900, 2, 29)","v":60},{"$f":"DATE(1900, 1, 22222)","v":22222},{"$f":"DATE(B8,B9,C10)","v":398},{"$f":"DATE(C8,C9,C10)","v":1},{"$f":"DATE(E8,E9,E10)","v":{"$error":"#VALUE!"}}]
[null,null,"EXPECTED VALUE",1,32,6727,39083,60,22222,398,1,{"$error":"#VALUE!"}]
[]
[]
[null,"Datedif","FORMULA"]
[null,null,"EXPECTED VALUE"]
[]
[]
[null,"Datestring","FORMULA"]
[null,null,"EXPECTED VALUE"]
[]
[]
[null,"Datevalue","FORMULA"]
[null,null,"EXPECTED VALUE"]
[]
[]
[null,"Daverage","FORMULA"]
[null,null,"EXPECTED VALUE"]
[]
[]
[null,"Day","FORMULA",{"$f":"DAY(C20)","v":25},{"$f":"DAY(1)","v":1},{"$f":"DAY(0)","v":0},{"$f":"DAY(C16)","v":{"$error":"#NUM!"}},{"$f":"DAY(#DIV/0!)","v":{"$error":"#DIV/0!"}}]
[null,null,"EXPECTED VALUE",25,1,0,{"$error":"#NUM!"},{"$error":"#DIV/0!"}]
[]
[]
[null,"Days360","FORMULA",{"$f":"DAYS360(B10,C10)","v":-526},{"$f":"DAYS360(DATE(1972,2,16), DATE(2012,2,16))","v":14400},{"$f":"DAYS360(DATE(2008,1,16), DATE(2008,5,16))","v":120}]
[null,null,"EXPECTED VALUE",-526,14400,120]
[]
[]
[null,"Db","FORMULA","WILL_NEVER_IMPLEMENT"]
[null,null,"EXPECTED VALUE","WILL_NEVER_IMPLEMENT"]
[]
[]
[null,"Dbcs","FORMULA","WILL_NEVER_IMPLEMENT"]
[null,null,"EXPECTED VALUE","WILL_NEVER_IMPLEMENT"]
[]
[]
[null,"Dcount","FORMULA"]
[null,null,"EXPECTED VALUE"]
[]
[]
[null,"Dcounta","FORMULA"]
[null,null,"EXPECTED VALUE"]
[]
[]
[null,"Ddb","FORMULA"]
[null,null,"EXPECTED VALUE"]
[]
[]
[null,"Degrees","FORMULA",{"$f":"DEGREES(B7)","v":0},{"$f":"DEGREES(B8)","v":57.29577951308232},{"$f":"DEGREES(B13)","v":-30595.94625998596},{"$f":"DEGREES(B16)","v":57.29577951308232},{"$f":"DEGREES(D7)","v":0},{"$f":"DEGREES(E7)","v":{"$error":"#VALUE!"}},{"$f":"DEGREES(\"1\")","v":57.29577951308232},{"$f":"DEGREES(E15)","v":57.29577951308232},{"$f":"DEGREES(F11)","v":0},{"$f":"DEGREES(K8:N8)","v":171.88733853924697},{"$f":"DEGREES(L366:L369)","v":0},{"$f":"DEGREES(N8:O9)","v":{"$error":"#VALUE!"}}]
[null,null,"EXPECTED VALUE",0,57.29577951308232,-30595.94625998596,57.29577951308232,0,{"$error":"#VALUE!"},57.29577951308232,57.29577951308232,0,171.88733853924697,0,{"$error":"#VALUE!"}]
[]
[]
[null,"Deletebar","FORMULA","WILL_NEVER_IMPLEMENT"]
[null,null,"EXPECTED VALUE","WILL_NEVER_IMPLEMENT"]
[]
[]
[null,"Deletecommand","FORMULA","WILL_NEVER_IMPLEMENT"]
[null,null,"EXPECTED VALUE","WILL_NEVER_IMPLEMENT"]
[]
[]
[null,"Deletemenu","FORMULA","WILL_NEVER_IMPLEMENT"]
[null,null,"EXPECTED VALUE","WILL_NEVER_IMPLEMENT"]
[]
[]
[null,"Deletetoolbar","FORMULA","WILL_NEVER_IMPLEMENT"]
[null,null,"EXPECTED VALUE","WILL_NEVER_IMPLEMENT"]
[]
[]
[null,"Deref","FORMULA"]
[null,null,"EXPECTED VALUE"]
[]
[]
[null,"Devsq","FORMULA",{"$f":"DEVSQ(B7:B9)","v":2},{"$f":"DEVSQ(B7:B9,C7:C9,B15:B17)","v":5.837134000085715},{"$f":"DEVSQ(B13:D14)","v":749730712528.7554},{"$f":"DEVSQ(D7:D9,C9)","v":0},{"$f":"DEVSQ(E15:E17)","v":{"$error":"#NUM!"}},{"$f":"DEVSQ(\"1\",\"2\",2)","v":0.6666666666666666},{"$f":"DEVSQ(F10,I7)","v":4.499970000049999}]
[null,null,"EXPECTED VALUE",2,5.837134000085715,749730712528.7554,0,{"$error":"#NUM!"},0.6666666666666666,4.499970000049999]
[]
[]
[null,"Dget","FORMULA","WILL_NEVER_IMPLEMENT"]
[null,null,"EXPECTED VALUE","WILL_NEVER_IMPLEMENT"]
[]
[]
[null,"Dialogbox","FORMULA","WILL_NEVER_IMPLEMENT"]
[null,null,"EXPECTED VALUE","WILL_NEVER_IMPLEMENT"]
[]
[]
[null,"Directory","FORMULA"]
[null,null,"EXPECTED VALUE"]
[]
[]
[null,"Dmax","FORMULA"]
[null,null,"EXPECTED VALUE"]
[]
[]
[null,"Dmin","FORMULA"]
[null,null,"EXPECTED VALUE"]
[]
[]
[null,"Documents","FORMULA","WILL_NEVER_IMPLEMENT"]
[null,null,"EXPECTED VALUE","WILL_NEVER_IMPLEMENT"]
[]
[]
[null,"Dollar","FORMULA",{"$f":"DOLLAR(B7)","v":"$0.00"},{"$f":"DOLLAR(B8)","v":"$1.00"},{"$f":"DOLLAR(B16)","v":"$1.00"},{"$f":"DOLLAR(D7)","v":"$0.00"},{"$f":"DOLLAR(C15)","v":"($1.00)"},{"$f":"DOLLAR(E7)","v":{"$error":"#VALUE!"}},{"$f":"DOLLAR(E15)","v":"$1.00"},{"$f":"DOLLAR(I9:L9)","v":"$3.00"},{"$f":"DOLLAR(J418:J421)","v":"$1.00"},{"$f":"DOLLAR(K9:L10)","v":{"$error":"#VALUE!"}},{"$f":"DOLLAR(G10)","v":{"$error":"#VALUE!"}}]
[null,null,"EXPECTED VALUE",0,1,1,0,-1.00001,{"$error":"#VALUE!"},1,3,1,{"$error":"#VALUE!"},{"$error":"#VALUE!"}]
[]
[]
[null,"Dproduct","FORMULA"]
[null,null,"EXPECTED VALUE"]
[]
[]
[null,"Dstdev","FORMULA"]
[null,null,"EXPECTED VALUE"]
[]
[]
[null,"Dstdevp","FORMULA"]
[null,null,"EXPECTED VALUE"]
[]
[]
[null,"Dsum","FORMULA"]
[null,null,"EXPECTED VALUE"]
[]
[]
[null,"Dvar","FORMULA"]
[null,null,"EXPECTED VALUE"]
[]
[]
[null,"Dvarp","FORMULA"]
[null,null,"EXPECTED VALUE"]
[]
[]
[null,"Echo","FORMULA"]
[null,null,"EXPECTED VALUE"]
[]
[]
[null,"Enablecommand","FORMULA","WILL_NEVER_IMPLEMENT"]
[null,null,"EXPECTED VALUE","WILL_NEVER_IMPLEMENT"]
[]
[]
[null,"Enabletool","FORMULA","WILL_NEVER_IMPLEMENT"]
[null,null,"EXPECTED VALUE","WILL_NEVER_IMPLEMENT"]
[]
[]
[null,"Error.type","FORMULA",{"$f":"ERROR.TYPE(AA7)","v":1},{"$f":"ERROR.TYPE(AA8)","v":2},{"$f":"ERROR.TYPE(AA9)","v":3},{"$f":"ERROR.TYPE(AA10)","v":4},{"$f":"ERROR.TYPE(AA11)","v":5},{"$f":"ERROR.TYPE(AA12)","v":6},{"$f":"ERROR.TYPE(AA13)","v":7},{"$f":"ERROR.TYPE(A14)","v":{"$error":"#N/A"}}]
[null,null,"EXPECTED VALUE",1,2,3,4,5,6,7,{"$error":"#N/A"}]
[]
[]
[null,"Errortype","FORMULA"]
[null,null,"EXPECTED VALUE"]
[]
[]
[null,"Evaluate","FORMULA"]
[null,null,"EXPECTED VALUE"]
[]
[]
[null,"Even","FORMULA",{"$f":"EVEN(B7)","v":0},{"$f":"EVEN(C7)","v":0},{"$f":"EVEN(C9)","v":2},{"$f":"EVEN(C15)","v":-2},{"$f":"EVEN(C17)","v":-2},{"$f":"EVEN(D7)","v":0},{"$f":"EVEN(E7)","v":{"$error":"#VALUE!"}},{"$f":"EVEN(E16)","v":2},{"$f":"EVEN(F10)","v":2},{"$f":"EVEN(J11:M11)","v":0},{"$f":"EVEN(L470:L473)","v":2}]
[null,null,"EXPECTED VALUE",0,0,2,-2,-2,0,{"$error":"#VALUE!"},2,2,0,2]
[]
[]
[null,"Exact","FORMULA",{"$f":"EXACT(123,\"123\")","v":true},{"$f":"EXACT(TRUE,B18)","v":true},{"$f":"EXACT(C9,C16)","v":false},{"$f":"EXACT(E13,E14)","v":false},{"$f":"EXACT(D8,D9)","v":true},{"$f":"EXACT(E9,F12)","v":true},{"$f":"EXACT(F12:G12,F12:G12)","v":{"$error":"#VALUE!"}},{"$f":"EXACT(J9:L9,K9)","v":true},{"$f":"EXACT(H475:H477,B18)","v":true}]
[null,null,"EXPECTED VALUE",true,true,false,false,true,true,{"$error":"#VALUE!"},true,true]
[]
[]
[null,"Exec","FORMULA","WILL_NEVER_IMPLEMENT"]
[null,null,"EXPECTED VALUE","WILL_NEVER_IMPLEMENT"]
[]
[]
[null,"Execute","FORMULA","WILL_NEVER_IMPLEMENT"]
[null,null,"EXPECTED VALUE","WILL_NEVER_IMPLEMENT"]
[]
[]
[null,"Exp","FORMULA",{"$f":"EXP(B8)","v":2.718281828459045},{"$f":"EXP(B7)","v":1},{"$f":"EXP(B17)","v":1},{"$f":"EXP(B15)","v":0.36787944117144233},{"$f":"EXP(B16)","v":2.718281828459045},{"$f":"EXP(E15)","v":2.718281828459045},{"$f":"EXP(E10)","v":{"$error":"#VALUE!"}},{"$f":"EXP(H12:L12)","v":1},{"$f":"EXP(K486:K489)","v":2.718281828459045}]
[null,null,"EXPECTED VALUE",2.718281828459045,1,1,0.36787944117144233,2.718281828459045,2.718281828459045,{"$error":"#VALUE!"},1,2.718281828459045]
[]
[]
[null,"Expondist","FORMULA"]
[null,null,"EXPECTED VALUE"]
[]
[]
[null,"Externalflag","FORMULA","NOT_A_FUNCTION"]
[null,null,"EXPECTED VALUE","NOT_A_FUNCTION"]
[]
[]
[null,"Fact","FORMULA",{"$f":"FACT(1)","v":1},{"$f":"FACT(0)","v":1},{"$f":"FACT(B9)","v":2},{"$f":"FACT(C11)","v":2},{"$f":"FACT(15)","v":1307674368000},{"$f":"FACT(B16)","v":1},{"$f":"FACT(B18)","v":{"$error":"#VALUE!"}},{"$f":"FACT(D9)","v":1},{"$f":"FACT(C15)","v":{"$error":"#NUM!"}},{"$f":"FACT(B14)","v":{"$error":"#NUM!"}},{"$f":"FACT(E17)","v":2},null,{"$f":"FACT(G12)","v":{"$error":"#VALUE!"}},{"$f":"FACT(F8)","v":1},{"$f":"FACT(G8)","v":1},{"$f":"FACT(G498:G501)","v":2},{"$f":"FACT(I11:J11)","v":{"$error":"#VALUE!"}}]
[null,null,"EXPECTED VALUE",1,1,2,2,1307674368000,1,{"$error":"#VALUE!"},1,{"$error":"#NUM!"},{"$error":"#NUM!"},2,null,{"$error":"#VALUE!"},1,1,2,{"$error":"#VALUE!"}]
[]
[]
[null,"False","FORMULA",{"$f":"FALSE()","v":false}]
[null,null,"EXPECTED VALUE",false]
[]
[]
[null,"Fclose","FORMULA","WILL_NEVER_IMPLEMENT"]
[null,null,"EXPECTED VALUE","WILL_NEVER_IMPLEMENT"]
[]
[]
[null,"Fdist","FORMULA"]
[null,null,"EXPECTED VALUE"]
[]
[]
[null,"Files","FORMULA","WILL_NEVER_IMPLEMENT"]
[null,null,"EXPECTED VALUE","WILL_NEVER_IMPLEMENT"]
[]
[]
[null,"Find","FORMULA",{"$f":"FIND(\"o\",E8)","v":2},{"$f":"FIND(\"O\",E8)","v":{"$error":"#VALUE!"}},{"$f":"FIND(\"Space\",E10)","v":9},{"$f":"FIND(\"s\",E9)","v":1},{"$f":"FIND(\"s\",E9,3)","v":8}]
[null,null,"EXPECTED VALUE",2,{"$error":"#VALUE!"},9,1,8]
[]
[]
[null,"Findb","FORMULA"]
[null,null,"EXPECTED VALUE"]
[]
[]
[null,"Finv","FORMULA"]
[null,null,"EXPECTED VALUE"]
[]
[]
[null,"Fisher","FORMULA"]
[null,null,"EXPECTED VALUE"]
[]
[]
[null,"Fisherinv","FORMULA"]
[null,null,"EXPECTED VALUE"]
[]
[]
[null,"Fixed","FORMULA"]
[null,null,"EXPECTED VALUE"]
[]
[]
[null,"Floor","FORMULA",{"$f":"FLOOR(1.002,2)","v":0},{"$f":"FLOOR(B10,B9)","v":534},{"$f":"FLOOR(C14,C16)","v":-2.2},{"$f":"FLOOR(C16,C15)","v":-1.00001},{"$f":"FLOOR(C17,C16)","v":0},{"$f":"FLOOR(0,0)","v":0},{"$f":"FLOOR(1,0)","v":{"$error":"#DIV/0!"}},{"$f":"FLOOR(K9:L9,K7)","v":3},{"$f":"FLOOR(F542:F545,G544)","v":-2.00002},{"$f":"FLOOR(G7:H8,H10)","v":{"$error":"#VALUE!"}}]
[null,null,"EXPECTED VALUE",0,534,-2.2,-1.00001,0,0,{"$error":"#DIV/0!"},3,-2.00002,{"$error":"#VALUE!"}]
[]
[]
[null,"Fopen","FORMULA","WILL_NEVER_IMPLEMENT"]
[null,null,"EXPECTED VALUE","WILL_NEVER_IMPLEMENT"]
[]
[]
[null,"Forecast","FORMULA"]
[null,null,"EXPECTED VALUE"]
[]
[]
[null,"Formulaconvert","FORMULA"]
[null,null,"EXPECTED VALUE"]
[]
[]
[null,"Fpos","FORMULA"]
[null,null,"EXPECTED VALUE"]
[]
[]
[null,"Fread","FORMULA","WILL_NEVER_IMPLEMENT"]
[null,null,"EXPECTED VALUE","WILL_NEVER_IMPLEMENT"]
[]
[]
[null,"Freadln","FORMULA","WILL_NEVER_IMPLEMENT"]
[null,null,"EXPECTED VALUE","WILL_NEVER_IMPLEMENT"]
[]
[]
[null,"Frequency","FORMULA"]
[null,null,"EXPECTED VALUE"]
[]
[]
[null,"Fsize","FORMULA","WILL_NEVER_IMPLEMENT"]
[null,null,"EXPECTED VALUE","WILL_NEVER_IMPLEMENT"]
[]
[]
[null,"Ftest","FORMULA"]
[null,null,"EXPECTED VALUE"]
[]
[]
[null,"Fv","FORMULA",{"$f":"FV(0,0,0)","v":{"v":0,"d":"$0.00"}},{"$f":"FV(0.01,10,100)","v":{"v":-1046.2212541120473,"d":"($1,046.22)"}},{"$f":"FV(0.01,10,B16)","v":{"v":-10.462212541120474,"d":"($10.46)"}}]
[null,null,"EXPECTED VALUE",0,-1046.2212541120473,-10.462212541120474]
[]
[]
[null,"Fwrite","FORMULA"]
[null,null,"EXPECTED VALUE"]
[]
[]
[null,"Fwriteln","FORMULA"]
[null,null,"EXPECTED VALUE"]
[]
[]
[null,"Gammadist","FORMULA"]
[null,null,"EXPECTED VALUE"]
[]
[]
[null,"Gammainv","FORMULA"]
[null,null,"EXPECTED VALUE"]
[]
[]
[null,"Gammaln","FORMULA"]
[null,null,"EXPECTED VALUE"]
[]
[]
[null,"Geomean","FORMULA"]
[null,null,"EXPECTED VALUE"]
[]
[]
[null,"Getbar","FORMULA","WILL_NEVER_IMPLEMENT"]
[null,null,"EXPECTED VALUE","WILL_NEVER_IMPLEMENT"]
[]
[]
[null,"Getcell","FORMULA","WILL_NEVER_IMPLEMENT"]
[null,null,"EXPECTED VALUE","WILL_NEVER_IMPLEMENT"]
[]
[]
[null,"Getchartitem","FORMULA","WILL_NEVER_IMPLEMENT"]
[null,null,"EXPECTED VALUE","WILL_NEVER_IMPLEMENT"]
[]
[]
[null,"Getdef","FORMULA","WILL_NEVER_IMPLEMENT"]
[null,null,"EXPECTED VALUE","WILL_NEVER_IMPLEMENT"]
[]
[]
[null,"Getdocument","FORMULA","WILL_NEVER_IMPLEMENT"]
[null,null,"EXPECTED VALUE","WILL_NEVER_IMPLEMENT"]
[]
[]
[null,"Getformula","FORMULA","WILL_NEVER_IMPLEMENT"]
[null,null,"EXPECTED VALUE","WILL_NEVER_IMPLEMENT"]
[]
[]
[null,"Getlinkinfo","FORMULA","WILL_NEVER_IMPLEMENT"]
[null,null,"EXPECTED VALUE","WILL_NEVER_IMPLEMENT"]
[]
[]
[null,"Getmovie","FORMULA","WILL_NEVER_IMPLEMENT"]
[null,null,"EXPECTED VALUE","WILL_NEVER_IMPLEMENT"]
[]
[]
[null,"Getname","FORMULA","WILL_NEVER_IMPLEMENT"]
[null,null,"EXPECTED VALUE","WILL_NEVER_IMPLEMENT"]
[]
[]
[null,"Getnote","FORMULA","WILL_NEVER_IMPLEMENT"]
[null,null,"EXPECTED VALUE","WILL_NEVER_IMPLEMENT"]
[]
[]
[null,"Getobject","FORMULA","WILL_NEVER_IMPLEMENT"]
[null,null,"EXPECTED VALUE","WILL_NEVER_IMPLEMENT"]
[]
[]
[null,"Getpivotdata","FORMULA"]
[null,null,"EXPECTED VALUE"]
[]
[]
[null,"Getpivotfield","FORMULA"]
[null,null,"EXPECTED VALUE"]
[]
[]
[null,"Getpivotitem","FORMULA"]
[null,null,"EXPECTED VALUE"]
[]
[]
[null,"Getpivottable","FORMULA"]
[null,null,"EXPECTED VALUE"]
[]
[]
[null,"Gettool","FORMULA","WILL_NEVER_IMPLEMENT"]
[null,null,"EXPECTED VALUE","WILL_NEVER_IMPLEMENT"]
[]
[]
[null,"Gettoolbar","FORMULA","WILL_NEVER_IMPLEMENT"]
[null,null,"EXPECTED VALUE","WILL_NEVER_IMPLEMENT"]
[]
[]
[null,"Getwindow","FORMULA","WILL_NEVER_IMPLEMENT"]
[null,null,"EXPECTED VALUE","WILL_NEVER_IMPLEMENT"]
[]
[]
[null,"Getworkbook","FORMULA","WILL_NEVER_IMPLEMENT"]
[null,null,"EXPECTED VALUE","WILL_NEVER_IMPLEMENT"]
[]
[]
[null,"Getworkspace","FORMULA","WILL_NEVER_IMPLEMENT"]
[null,null,"EXPECTED VALUE","WILL_NEVER_IMPLEMENT"]
[]
[]
[null,"Goto","FORMULA"]
[null,null,"EXPECTED VALUE"]
[]
[]
[null,"Group","FORMULA"]
[null,null,"EXPECTED VALUE"]
[]
[]
[null,"Growth","FORMULA"]
[null,null,"EXPECTED VALUE"]
[]
[]
[null,"Halt","FORMULA"]
[null,null,"EXPECTED VALUE"]
[]
[]
[null,"Harmean","FORMULA"]
[null,null,"EXPECTED VALUE"]
[]
[]
[null,"Help","FORMULA"]
[null,null,"EXPECTED VALUE"]
[]
[]
[null,"Hlookup","FORMULA",{"$f":"HLOOKUP(\"DOUBLE\",$B$6:$H$12,3, FALSE)","v":1e-05},{"$f":"HLOOKUP(\"DOUBLE\",$B$6:$H$12,3, FALSE)","v":1e-05},{"$f":"HLOOKUP(\"STRing\",$B$6:$H$12,3, FALSE)","v":"nospaces"},{"$f":"HLOOKUP(\"STRING\",$B$6:$H$12,6, TRUE)","v":" beginsWithSpace"}]
[null,null,"EXPECTED VALUE",1e-05,1e-05,"nospaces"," beginsWithSpace"]
[]
[]
[null,"Hour","FORMULA",{"$f":"HOUR(1)","v":0},{"$f":"HOUR(0.75)","v":18},{"$f":"HOUR(0.33)","v":7},{"$f":"HOUR(D7)","v":0},{"$f":"HOUR(E8)","v":{"$error":"#VALUE!"}}]
[null,null,"EXPECTED VALUE",0,18,7,0,{"$error":"#VALUE!"}]
[]
[]
[null,"Hyperlink","FORMULA",{"$f":"HYPERLINK(\"http://poi.apache.org\")","v":"http://poi.apache.org"}]
[null,null,"EXPECTED VALUE","http://poi.apache.org"]
[]
[]
[null,"Hypgeomdist","FORMULA"]
[null,null,"EXPECTED VALUE"]
[]
[]
[null,"If","FORMULA",{"$f":"IF(1>2,3)","v":false},{"$f":"IF(1>2,3,4)","v":4},{"$f":"IF(B10,3)","v":3},{"$f":"IF(D7,#VALUE!, 3)","v":3},{"$f":"IF(ISERROR(B8/B7),\"error detected\")","v":"error detected"},{"$f":"IF(ISERROR(B8/B8),1,IF(3>4,2,IF(B8>B7,3,-1)))","v":3},{"$f":"IF(ISERROR((B9+B8)/(B7*C8)),\"error detected\")","v":"error detected"},{"$f":"IF(B7*B8/C8*C11>0,B16,B17)","v":false},{"$f":"IF(AA11,1)","v":{"$error":"#NAME?"}},{"$f":"IF(\"tRue\", \"A\", \"B\")","v":"A"}]
[null,null,"EXPECTED VALUE",false,4,3,3,"error detected",3,"error detected",false,{"$error":"#NAME?"},"A"]
[]
[]
[null,"Index","FORMULA",{"$f":"INDEX(B14:C15,2,2)","v":-1.00001},{"$f":"INDEX(B14:C15,D7,2)","v":{"$error":"#VALUE!"}}]
[null,null,"EXPECTED VALUE",-1.00001,{"$error":"#VALUE!"}]
[]
[]
[null,"Indirect","FORMULA",{"$f":"INDIRECT(\"B9\")","v":2},{"$f":"INDIRECT(\"$B$9\")","v":2},{"$f":"INDIRECT(D10)","v":{"$error":"#REF!"}}]
[null,null,"EXPECTED VALUE",2,2,{"$error":"#REF!"}]
[]
[]
[null,"Info","FORMULA"]
[null,null,"EXPECTED VALUE"]
[]
[]
[null,"Initiate","FORMULA"]
[null,null,"EXPECTED VALUE"]
[]
[]
[null,"Input","FORMULA"]
[null,null,"EXPECTED VALUE"]
[]
[]
[null,"Int","FORMULA",{"$f":"INT(B7)","v":0},{"$f":"INT(B14)","v":-2},{"$f":"INT(B16)","v":1},{"$f":"INT(B18)","v":{"$error":"#VALUE!"}},{"$f":"INT(C9)","v":1},{"$f":"INT(C17)","v":-1},{"$f":"INT(E14)","v":0},{"$f":"INT(E7)","v":{"$error":"#VALUE!"}},{"$f":"INT(F10)","v":0},{"$f":"INT(J8:M8)","v":3},{"$f":"INT(M754:M757)","v":3},{"$f":"INT(N8:O9)","v":{"$error":"#VALUE!"}}]
[null,null,"EXPECTED VALUE",0,-2,1,{"$error":"#VALUE!"},1,-1,0,{"$error":"#VALUE!"},0,3,3,{"$error":"#VALUE!"}]
[]
[]
[null,"Intercept","FORMULA"]
[null,null,"EXPECTED VALUE"]
[]
[]
[null,"Ipmt","FORMULA"]
[null,null,"EXPECTED VALUE"]
[]
[]
[null,"Irr","FORMULA",{"$f":"TRUNC(IRR(AL7:AL11),4)","v":{"v":-0.0768,"d":"-7.68%"}},{"$f":"TRUNC(IRR(AL7:AL12),4)","v":{"v":0.0538,"d":"5.38%"}},{"$f":"TRUNC(IRR(AL7:AL9, -10%),4)","v":{"v":-0.4435,"d":"-44.35%"}}]
[null,null,"EXPECTED VALUE",{"v":-0.0768,"d":"-7.68%"},{"v":0.0538,"d":"5.38%"},{"v":-0.4435,"d":"-44.35%"}]
[]
[]
[null,"Isblank","FORMULA",{"$f":"ISBLANK(B7)","v":false},{"$f":"ISBLANK(B11)","v":false},{"$f":"ISBLANK(B17)","v":false},{"$f":"ISBLANK(D8)","v":true},{"$f":"ISBLANK(E7)","v":false},{"$f":"ISBLANK(F15)","v":true},{"$f":"ISBLANK(J14:K14)","v":true},{"$f":"ISBLANK(K13:L14)","v":false},{"$f":"ISBLANK(D7:D7)","v":true}]
[null,null,"EXPECTED VALUE",false,false,false,true,false,true,true,false,true]
[]
[]
[null,"Iserr","FORMULA"]
[null,null,"EXPECTED VALUE"]
[]
[]
[null,"IsError","FORMULA",{"$f":"ISERROR(B7)","v":false},{"$f":"ISERROR(B17)","v":false},{"$f":"ISERROR(B8/C7)","v":true},{"$f":"ISERROR(C10:C13)","v":true},{"$f":"ISERROR(C16:E16)","v":true},{"$f":"ISERROR(F14)","v":false},{"$f":"ISERROR(I11:K11)","v":false},{"$f":"ISERROR(I778:I781)","v":false},{"$f":"ISERROR(H780)","v":false}]
[null,null,"EXPECTED VALUE",false,false,true,true,true,false,false,false,false]
[]
[]
[null,"Islogical","FORMULA",{"$f":"ISLOGICAL(B7)","v":false},{"$f":"ISLOGICAL(B16)","v":true},{"$f":"ISLOGICAL(B17)","v":true},{"$f":"ISLOGICAL(B18)","v":false},{"$f":"ISLOGICAL(B19)","v":false},{"$f":"ISLOGICAL(C18)","v":false},{"$f":"ISLOGICAL(TRUE())","v":true},{"$f":"ISLOGICAL(TRUE)","v":true},{"$f":"ISLOGICAL(B16:B17)","v":false}]
[null,null,"EXPECTED VALUE",false,true,true,false,false,false,true,true,false]
[]
[]
[null,"IsNa","FORMULA",{"$f":"ISNA(#N/A)","v":true},{"$f":"ISNA(42)","v":false},{"$f":"ISNA(AA13)","v":true},{"$f":"ISNA(AA8)","v":false},{"$f":"ISNA(AA14)","v":false},{"$f":"ISNA(B16)","v":false}]
[null,null,"EXPECTED VALUE",true,false,true,false,false,false]
[]
[]
[null,"Isnontext","FORMULA",{"$f":"ISNONTEXT(1)","v":true},{"$f":"ISNONTEXT(TRUE)","v":true},{"$f":"ISNONTEXT(\"1\")","v":false},{"$f":"ISNONTEXT(\"true\")","v":false},{"$f":"ISNONTEXT(B7)","v":true},{"$f":"ISNONTEXT(B18)","v":false},{"$f":"ISNONTEXT(F12)","v":false},{"$f":"ISNONTEXT(B18:B19)","v":true},{"$f":"ISNONTEXT(D7)","v":true}]
[null,null,"EXPECTED VALUE",true,true,false,false,true,false,false,true,true]
[]
[]
[null,"Isnumber","FORMULA",{"$f":"ISNUMBER(0)","v":true},{"$f":"ISNUMBER(\"a\")","v":false},{"$f":"ISNUMBER(TRUE)","v":false},{"$f":"ISNUMBER(B7)","v":true},{"$f":"ISNUMBER(B18)","v":false},{"$f":"ISNUMBER(B16)","v":false},{"$f":"ISNUMBER(C10)","v":true},{"$f":"ISNUMBER(D7)","v":false},{"$f":"ISNUMBER(E7)","v":false},{"$f":"ISNUMBER(E15)","v":false},{"$f":"ISNUMBER(F7)","v":true},{"$f":"ISNUMBER(F13)","v":false},{"$f":"ISNUMBER(G7:J7)","v":false},{"$f":"ISNUMBER(K7:K9)","v":false}]
[null,null,"EXPECTED VALUE",true,false,false,true,false,false,true,false,false,false,true,false,false,false]
[]
[]
[null,"Ispmt","FORMULA"]
[null,null,"EXPECTED VALUE"]
[]
[]
[null,"Isref","FORMULA",{"$f":"ISREF(0)","v":false},{"$f":"ISREF(\"a17\")","v":false},{"$f":"ISREF(TRUE)","v":false},{"$f":"ISREF(B7)","v":true},{"$f":"ISREF(G7:G9)","v":true},{"$f":"ISREF(G7:I9)","v":true},{"$f":"ISREF(D7)","v":true},{"$f":"ISREF(\"\")","v":false}]
[null,null,"EXPECTED VALUE",false,false,false,true,true,true,true,false]
[]
[]
[null,"Istext","FORMULA",{"$f":"ISTEXT(1)","v":false},{"$f":"ISTEXT(TRUE)","v":false},{"$f":"ISTEXT(\"1\")","v":true},{"$f":"ISTEXT(\"true\")","v":true},{"$f":"ISTEXT(B23)","v":true},{"$f":"ISTEXT(B34)","v":false},{"$f":"ISTEXT(F28)","v":true},{"$f":"ISTEXT(B34:B35)","v":false},{"$f":"ISTEXT(D23)","v":false}]
[null,null,"EXPECTED VALUE",false,false,true,true,true,false,true,false,false]
[]
[]
[null,"Kurt","FORMULA"]
[null,null,"EXPECTED VALUE"]
[]
[]
[null,"Large","FORMULA",{"$f":"LARGE(B7:C14,1)","v":9999999999},{"$f":"LARGE(B8:B10,3)","v":1},{"$f":"LARGE(B9:B16,4)","v":-1},{"$f":"LARGE(TRUE,1)","v":1},{"$f":"LARGE(\"2.3\",1)","v":2.3},{"$f":"LARGE(E8:E12,3)","v":{"$error":"#NUM!"}},{"$f":"LARGE(D7:D8,1)","v":{"$error":"#NUM!"}},{"$f":"LARGE(C7:E9,3)","v":0},{"$f":"LARGE(E8:F10,2)","v":1},{"$f":"LARGE(F10:I13,3)","v":345}]
[null,null,"EXPECTED VALUE",9999999999,1,-1,1,2.3,{"$error":"#NUM!"},{"$error":"#NUM!"},0,1,345]
[]
[]
[null,"Lasterror","FORMULA"]
[null,null,"EXPECTED VALUE"]
[]
[]
[null,"Left","FORMULA",{"$f":"LEFT(\"a string\",0)","v":""},{"$f":"LEFT(\"a string\",\"6\")","v":"a stri"},{"$f":"LEFT(\"a string\",10)","v":"a string"},{"$f":"LEFT(\"a string\",B9)","v":"a "},{"$f":"LEFT(E12, E17)","v":"no"},{"$f":"LEFT(TRUE,2)","v":"TR"},{"$f":"LEFT(G7:H9,H10)","v":{"$error":"#VALUE!"}},{"$f":"LEFT(\"a string\", TRUE)","v":"a"}]
[null,null,"EXPECTED VALUE","","a stri","a string","a ","no","TR",{"$error":"#VALUE!"},"a"]
[]
[]
[null,"Leftb","FORMULA"]
[null,null,"EXPECTED VALUE"]
[]
[]
[null,"Len","FORMULA",{"$f":"LEN(B10)","v":3},{"$f":"LEN(F20)","v":1},{"$f":"LEN(D7)","v":0},{"$f":"LEN(E14)","v":8},{"$f":"LEN(G11)","v":10},{"$f":"LEN(H11:J11)","v":3},{"$f":"LEN(G831:G833)","v":1},{"$f":"LEN(K8:L10)","v":{"$error":"#VALUE!"}},{"$f":"LEN(AA12)","v":{"$error":"#NUM!"}}]
[null,null,"EXPECTED VALUE",3,1,0,8,10,3,1,{"$error":"#VALUE!"},{"$error":"#NUM!"}]
[]
[]
[null,"Lenb","FORMULA"]
[null,null,"EXPECTED VALUE"]
[]
[]
[null,"Linest","FORMULA"]
[null,null,"EXPECTED VALUE"]
[]
[]
[null,"Links","FORMULA"]
[null,null,"EXPECTED VALUE"]
[]
[]
[null,"Ln","FORMULA",{"$f":"LN(B7)","v":{"$error":"#NUM!"}},{"$f":"LN(B8)","v":0},{"$f":"LN(B13)","v":{"$error":"#NUM!"}},{"$f":"LN(B16)","v":0},{"$f":"LN(B15)","v":{"$error":"#NUM!"}},{"$f":"LN(B18)","v":{"$error":"#VALUE!"}},{"$f":"LN(C9)","v":0.09531017980432493},{"$f":"LN(E7)","v":{"$error":"#VALUE!"}},{"$f":"LN(E16)","v":0.09531017980432493},{"$f":"LN(G13)","v":{"$error":"#NUM!"}},{"$f":"LN(K8:N8)","v":{"$error":"#NUM!"}},{"$f":"LN(M9:O9)","v":6.118097198041348},{"$f":"LN(O846:O849)","v":1.8112511328273146}]
[null,null,"EXPECTED VALUE",{"$error":"#NUM!"},0,{"$error":"#NUM!"},0,{"$error":"#NUM!"},{"$error":"#VALUE!"},0.09531017980432493,{"$error":"#VALUE!"},0.09531017980432493,{"$error":"#NUM!"},{"$error":"#NUM!"},6.118097198041348,1.8112511328273146]
[]
[]
[null,"Log","FORMULA",{"$f":"LOG(B7)","v":{"$error":"#NUM!"}},{"$f":"LOG(B7,2)","v":{"$error":"#NUM!"}},{"$f":"LOG(B8,2)","v":0},{"$f":"LOG(B10,534)","v":1},{"$f":"LOG(B12,20)","v":{"$error":"#NUM!"}},{"$f":"LOG(B11,12)","v":9.266284080251024},{"$f":"LOG(C9,C10)","v":9531.065635380532},{"$f":"LOG(F17,E15)","v":{"$error":"#NUM!"}},{"$f":"LOG(F15,F16)","v":{"$error":"#NUM!"}},{"$f":"LOG(B10,B9)","v":9.060695931687555}]
[null,null,"EXPECTED VALUE",{"$error":"#NUM!"},{"$error":"#NUM!"},0,1,{"$error":"#NUM!"},9.266284080251024,9531.065635380532,{"$error":"#NUM!"},{"$error":"#NUM!"},9.060695931687555]
[]
[]
[null,"Log10","FORMULA",{"$f":"LOG10(B7)","v":{"$error":"#NUM!"}},{"$f":"LOG10(B8)","v":0},{"$f":"LOG10(B10)","v":2.727541257028556},{"$f":"LOG10(B13)","v":{"$error":"#NUM!"}},{"$f":"LOG10(B16)","v":0},{"$f":"LOG10(B17)","v":{"$error":"#NUM!"}},{"$f":"LOG10(B18)","v":{"$error":"#VALUE!"}},{"$f":"LOG10(E7)","v":{"$error":"#VALUE!"}},{"$f":"LOG10(E15)","v":0},{"$f":"LOG10(F13)","v":0.47711980706897666},{"$f":"LOG10(L9:N9)","v":2.537819095073274},{"$f":"LOG10(N855:N857)","v":0.4044606607801223}]
[null,null,"EXPECTED VALUE",{"$error":"#NUM!"},0,2.727541257028556,{"$error":"#NUM!"},0,{"$error":"#NUM!"},{"$error":"#VALUE!"},{"$error":"#VALUE!"},0,0.47711980706897666,2.537819095073274,0.4044606607801223]
[]
[]
[null,"Logest","FORMULA"]
[null,null,"EXPECTED VALUE"]
[]
[]
[null,"Loginv","FORMULA"]
[null,null,"EXPECTED VALUE"]
[]
[]
[null,"Lognormdist","FORMULA"]
[null,null,"EXPECTED VALUE"]
[]
[]
[null,"Lookup","FORMULA",{"$f":"LOOKUP(534,B6:B15,E6:E15)","v":"endsWithSpace "},{"$f":"LOOKUP(\"DOUBLE\",C6:G6,C9:G9)","v":1.1}]
[null,null,"EXPECTED VALUE","endsWithSpace ",1.1]
[]
[]
[null,"Lower","FORMULA",{"$f":"LOWER(\"ALL UPPER\")","v":"all upper"},{"$f":"LOWER(\"MixedCase\")","v":"mixedcase"},{"$f":"LOWER(B10)","v":"534"},{"$f":"LOWER(B16)","v":"true"},{"$f":"LOWER(B18)","v":"true"},{"$f":"LOWER(E11)","v":" beginswithspace"},{"$f":"LOWER(E19)","v":"alph4num3ric"},{"$f":"LOWER(E11:G11)","v":{"$error":"#VALUE!"}},{"$f":"LOWER(F11:F14)","v":{"$error":"#VALUE!"}},{"$f":"LOWER(K7:M7)","v":"alphanum"},{"$f":"LOWER(M875:M877)","v":"alphanum"},{"$f":"LOWER(N8:O10)","v":{"$error":"#VALUE!"}},{"$f":"LOWER(AA8)","v":{"$error":"#DIV/0!"}}]
[null,null,"EXPECTED VALUE","all upper","mixedcase","534","true","true"," beginswithspace","alph4num3ric",{"$error":"#VALUE!"},{"$error":"#VALUE!"},"alphanum","alphanum",{"$error":"#VALUE!"},{"$error":"#DIV/0!"}]
[]
[]
[null,"Match","FORMULA",{"$f":"MATCH(5,B7:B10)","v":3},{"$f":"MATCH(600, B7:B10)","v":4},{"$f":"MATCH(-5, B7:B10)","v":{"$error":"#N/A"}}]
[null,null,"EXPECTED VALUE",3,4,{"$error":"#N/A"}]
[]
[]
[null,"Max","FORMULA",{"$f":"MAX(B7:B19)","v":9999999999},{"$f":"MAX(C7:E19)","v":999999.99999},{"$f":"MAX(C13:C15,E19,E17)","v":-1.00001},{"$f":"MAX(B16:B19)","v":0},{"$f":"MAX(B14:B16)","v":-1},{"$f":"MAX(D9:I12)","v":9999999999},{"$f":"MAX(G8:I9)","v":5.6789},{"$f":"MAX(F11,E11,E13:E15,H9:I11,L8)","v":345}]
[null,null,"EXPECTED VALUE",9999999999,999999.99999,-1.00001,0,-1,9999999999,5.6789,345]
[]
[]
[null,"Maxa","FORMULA",{"$f":"MAXA(B7:B10)","v":534},{"$f":"MAXA(C14:C17)","v":-1e-05},{"$f":"MAXA(B14:B17)","v":1},{"$f":"MAXA(B11:B19,C13:C14,C10:D11,E10:E15)","v":9999999999},{"$f":"MAXA(E15:E17,C14,G9)","v":2.3456},{"$f":"MAXA(I8,G8:G9,F12)","v":3.5},{"$f":"MAXA(F14,E19,F12)","v":0}]
[null,null,"EXPECTED VALUE",534,-1e-05,1,9999999999,2.3456,3.5,0]
[]
[]
[null,"Mdeterm","FORMULA"]
[null,null,"EXPECTED VALUE"]
[]
[]
[null,"Median","FORMULA",{"$f":"MEDIAN(B7:B9,B10:B12,B13:B15,B16:B18)","v":0},{"$f":"MEDIAN(B15:B17)","v":-1},{"$f":"MEDIAN(B16:D16)","v":-1.1},{"$f":"MEDIAN(C7:D9)","v":1e-05},{"$f":"MEDIAN(E7:E10)","v":{"$error":"#NUM!"}},{"$f":"MEDIAN(D9:D16)","v":{"$error":"#NUM!"}},{"$f":"MEDIAN(\"2\",2)","v":2},{"$f":"MEDIAN(TRUE,2)","v":1.5},{"$f":"MEDIAN(E9:G10)","v":2.3456}]
[null,null,"EXPECTED VALUE",0,-1,-1.1,1e-05,{"$error":"#NUM!"},{"$error":"#NUM!"},2,1.5,2.3456]
[]
[]
[null,"Mid","FORMULA",{"$f":"MID(E8,1,3)","v":"nos"},{"$f":"MID(E8,2,4)","v":"ospa"},{"$f":"MID(E9,4,1)","v":"a"},{"$f":"MID(E20, 1, 2)","v":""}]
[null,null,"EXPECTED VALUE","nos","ospa","a",""]
[]
[]
[null,"Midb","FORMULA"]
[null,null,"EXPECTED VALUE"]
[]
[]
[null,"Min","FORMULA",{"$f":"MIN(B7:B12)","v":-9999999999},{"$f":"MIN(B15:B19)","v":-1},{"$f":"MIN(B13:C17)","v":-999999.99999},{"$f":"MIN(C10:E12)","v":1.00001},{"$f":"MIN(E7:G8,G9,H8,H10,E15)","v":0},{"$f":"MIN(1,\"-2\",C14,E19,E16)","v":-2.99999},{"$f":"MIN(\"-100\",E17)","v":-100},{"$f":"MIN(E16,B9)","v":2},{"$f":"MIN(G9,G8,G7,F10,F12,E16,\"-20\")","v":-20},{"$f":"MIN(E10:E12)","v":0}]
[null,null,"EXPECTED VALUE",-9999999999,-1,-999999.99999,1.00001,0,-2.99999,-100,2,-20,0]
[]
[]
[null,"Mina","FORMULA",{"$f":"MINA(B8:D12)","v":-9999999999},{"$f":"MINA(E15:E17)","v":0},{"$f":"MINA(B16,B10,B9)","v":1},{"$f":"MINA(E9:G13,I11,I9,H8,H14)","v":0},{"$f":"MINA(\"-23\",E13,S7)","v":-23},{"$f":"MINA(E9:E14)","v":0},{"$f":"MINA(F12:F14,F10)","v":0}]
[null,null,"EXPECTED VALUE",-9999999999,0,1,0,-23,0,0]
[]
[]
[null,"Minute","FORMULA",{"$f":"MINUTE(1)","v":0},{"$f":"MINUTE(TIME(0,15,0))","v":15},{"$f":"MINUTE(E9)","v":{"$error":"#VALUE!"}}]
[null,null,"EXPECTED VALUE",0,15,{"$error":"#VALUE!"}]
[]
[]
[null,"Minverse","FORMULA"]
[null,null,"EXPECTED VALUE"]
[]
[]
[null,"Mirr","FORMULA"]
[null,null,"EXPECTED VALUE"]
[]
[]
[null,"Mmult","FORMULA"]
[null,null,"EXPECTED VALUE"]
[]
[]
[null,"Mod","FORMULA",{"$f":"MOD(C11,C15)","v":-4.0000000000262048E-5},{"$f":"MOD(B9,B14)","v":0},{"$f":"MOD(B14,B16)","v":0},{"$f":"MOD(\"23\",\"3\")","v":2},{"$f":"MOD(E17,E16)","v":0.7999899999999998},{"$f":"MOD(D17,D16)","v":{"$error":"#DIV/0!"}},{"$f":"MOD(D17,E16)","v":0},{"$f":"MOD(I11:L11,J7)","v":0},{"$f":"MOD(G931:G933,3)","v":2},{"$f":"MOD(I8:J9,2)","v":{"$error":"#VALUE!"}},{"$f":"MOD(700,M9:O9)","v":10}]
[null,null,"EXPECTED VALUE",-4.0000000000262048E-5,0,0,2,0.7999899999999998,{"$error":"#DIV/0!"},0,0,2,{"$error":"#VALUE!"},10]
[]
[]
[null,"Mode","FORMULA",{"$f":"MODE(B7:B15)","v":{"$error":"#N/A"}},{"$f":"MODE(B8:B16)","v":{"$error":"#N/A"}},{"$f":"MODE(B7:C9)","v":0},{"$f":"MODE(C9,E16,\"1\",B8)","v":{"$error":"#VALUE!"}},{"$f":"MODE(B8,\"1\",2,3)","v":{"$error":"#VALUE!"}},{"$f":"MODE(1,1,2,3)","v":1},{"$f":"MODE(E7:G9)","v":1},{"$f":"MODE(\"1\",1,#DIV/0!,2,3)","v":{"$error":"#VALUE!"}},{"$f":"MODE(C16:E16,-1.1)","v":-1.1},{"$f":"MODE(B9,2,D7)","v":{"$error":"#VALUE!"}}]
[null,null,"EXPECTED VALUE",{"$error":"#N/A"},{"$error":"#N/A"},0,{"$error":"#VALUE!"},{"$error":"#VALUE!"},1,1,{"$error":"#VALUE!"},-1.1,{"$error":"#VALUE!"}]
[]
[]
[null,"Month","FORMULA",{"$f":"MONTH(C20)","v":12},{"$f":"MONTH(1)","v":1},{"$f":"MONTH(0)","v":1},{"$f":"MONTH(-10)","v":{"$error":"#NUM!"}},{"$f":"MONTH(#N/A)","v":{"$error":"#N/A"}},{"$f":"MONTH(C20+60)","v":2}]
[null,null,"EXPECTED VALUE",12,1,1,{"$error":"#NUM!"},{"$error":"#N/A"},2]
[]
[]
[null,"Moviecommand","FORMULA","WILL_NEVER_IMPLEMENT"]
[null,null,"EXPECTED VALUE","WILL_NEVER_IMPLEMENT"]
[]
[]
[null,"N","FORMULA"]
[null,null,"EXPECTED VALUE"]
[]
[]
[null,"Na","FORMULA",{"$f":"NA()","v":{"$error":"#N/A"}}]
[null,null,"EXPECTED VALUE",{"$error":"#N/A"}]
[]
[]
[null,"Names","FORMULA"]
[null,null,"EXPECTED VALUE"]
[]
[]
[null,"Negbinomdist","FORMULA"]
[null,null,"EXPECTED VALUE"]
[]
[]
[null,"Normdist","FORMULA"]
[null,null,"EXPECTED VALUE"]
[]
[]
[null,"Norminv","FORMULA"]
[null,null,"EXPECTED VALUE"]
[]
[]
[null,"Normsdist","FORMULA"]
[null,null,"EXPECTED VALUE"]
[]
[]
[null,"Normsinv","FORMULA"]
[null,null,"EXPECTED VALUE"]
[]
[]
[null,"Not","FORMULA",{"$f":"NOT(0)","v":true},{"$f":"NOT(FALSE)","v":true},{"$f":"NOT(TRUE)","v":false},{"$f":"NOT(1+1=2)","v":false},{"$f":"NOT(E8)","v":{"$error":"#VALUE!"}}]
[null,null,"EXPECTED VALUE",true,true,false,false,{"$error":"#VALUE!"}]
[]
[]
[null,"Note","FORMULA"]
[null,null,"EXPECTED VALUE"]
[]
[]
[null,"Now","FORMULA"]
[null,null,"EXPECTED VALUE"]
[]
[]
[null,"Nper","FORMULA",{"$f":"NPER(0.01,1,10)","v":-9.578594039813161},{"$f":"NPER(\"0.01\", TRUE, \"10\", -20)","v":8.744571238244413},{"$f":"NPER(0.01, \"100\", \"1000\", -2000, TRUE)","v":8.669093074120488},{"$f":"NPER(0.05,10, 100, -200,D7)","v":5.896312860369899},{"$f":"NPER(0.01, #N/A, -200, 300)","v":{"$error":"#N/A"}},{"$f":"NPER(12,4500,100000,100000)","v":{"$error":"#NUM!"}}]
[null,null,"EXPECTED VALUE",-9.578594039813161,8.744571238244413,8.669093074120488,5.896312860369899,{"$error":"#N/A"},{"$error":"#NUM!"}]
[]
[]
[null,"Npv","FORMULA",{"$f":"TRUNC(NPV(5%,AL9:AL12),4)","v":{"v":62368.5604,"d":"$62,368.56"}},{"$f":"TRUNC(NPV(10%,-10000,3000,4200,6800),2)","v":{"v":1188.44,"d":"$1,188.44"}}]
[null,null,"EXPECTED VALUE",62368.56,1188.44]
[]
[]
[null,"Numberstring","FORMULA"]
[null,null,"EXPECTED VALUE"]
[]
[]
[null,"Odd","FORMULA",{"$f":"ODD(B7)","v":1},{"$f":"ODD(C17)","v":-1},{"$f":"ODD(B13)","v":-535},{"$f":"ODD(B8)","v":1},{"$f":"ODD(B17)","v":1},{"$f":"ODD(B16)","v":1},{"$f":"ODD(H11:J11)","v":1},{"$f":"ODD(J1002:J1005)","v":1},{"$f":"ODD(K10:M10)","v":5},{"$f":"ODD(L7:N7)","v":{"$error":"#VALUE!"}},{"$f":"ODD(K8:L9)","v":{"$error":"#VALUE!"}}]
[null,null,"EXPECTED VALUE",1,-1,-535,1,1,1,1,1,5,{"$error":"#VALUE!"},{"$error":"#VALUE!"}]
[]
[]
[null,"Offset","FORMULA",{"$f":"OFFSET(G7, 2, 0)","v":2.3456},{"$f":"OFFSET(G7, 0, 3)","v":4},{"$f":"OFFSET(G7, \"2.1\", \"1.9\")","v":3.4567},{"$f":"OFFSET(F7, E7:I7, E7:I7)","v":1.001}]
[null,null,"EXPECTED VALUE",2.3456,4,3.4567,1.001]
[]
[]
[null,"Opendialog","FORMULA","WILL_NEVER_IMPLEMENT"]
[null,null,"EXPECTED VALUE","WILL_NEVER_IMPLEMENT"]
[]
[]
[null,"Optionslistsget","FORMULA","WILL_NEVER_IMPLEMENT"]
[null,null,"EXPECTED VALUE","WILL_NEVER_IMPLEMENT"]
[]
[]
[null,"Or","FORMULA",{"$f":"OR(B7)","v":false},{"$f":"OR(B7:B9,C8,D7,B18,B17,E8,E15,F12)","v":true},{"$f":"OR(E7:E16,E18,E19,B18)","v":{"$error":"#VALUE!"}},{"$f":"OR(D7,E7,E8,B18)","v":{"$error":"#VALUE!"}},{"$f":"OR(H12)","v":true},{"$f":"OR(H13:J13)","v":{"$error":"#VALUE!"}},{"$f":"OR(I12:K12)","v":true},{"$f":"OR(J12:L12)","v":false}]
[null,null,"EXPECTED VALUE",false,true,{"$error":"#VALUE!"},{"$error":"#VALUE!"},true,{"$error":"#VALUE!"},true,false]
[]
[]
[null,"Pause","FORMULA","WILL_NEVER_IMPLEMENT"]
[null,null,"EXPECTED VALUE","WILL_NEVER_IMPLEMENT"]
[]
[]
[null,"Pearson","FORMULA"]
[null,null,"EXPECTED VALUE"]
[]
[]
[null,"Percentile","FORMULA"]
[null,null,"EXPECTED VALUE"]
[]
[]
[null,"Percentrank","FORMULA"]
[null,null,"EXPECTED VALUE"]
[]
[]
[null,"Permut","FORMULA"]
[null,null,"EXPECTED VALUE"]
[]
[]
[null,"Phonetic","FORMULA","WILL_NEVER_IMPLEMENT"]
[null,null,"EXPECTED VALUE","WILL_NEVER_IMPLEMENT"]
[]
[]
[null,"Pi","FORMULA",{"$f":"PI()","v":3.141592653589793}]
[null,null,"EXPECTED VALUE",3.14159265358979]
[]
[]
[null,"Pivotadddata","FORMULA","WILL_NEVER_IMPLEMENT"]
[null,null,"EXPECTED VALUE","WILL_NEVER_IMPLEMENT"]
[]
[]
[null,"Pmt","FORMULA",{"$f":"PMT(0.01, 10, B16)","v":{"v":-0.10558207655117136,"d":"($0.11)"}},{"$f":"PMT(\"0.01\", \"12\", \"200\", \"-300\", TRUE)","v":{"v":5.82661274042987,"d":"$5.83"}},{"$f":"PMT(\"0.01\", \"12\", \"200\", \"-300\", \"TRUE\")","v":{"$error":"#VALUE!"}}]
[null,null,"EXPECTED VALUE",-0.10558207655117115,5.826612740429869,{"$error":"#VALUE!"}]
[]
[]
[null,"Poisson","FORMULA",{"$f":"POISSON(2, 5, TRUE)","v":0.12465201948308113},{"$f":"POISSON(2, 5, FALSE)","v":0.08422433748856833}]
[null,null,"EXPECTED VALUE",0.124652019,0.084224337]
[]
[]
[null,"Poke","FORMULA","WILL_NEVER_IMPLEMENT"]
[null,null,"EXPECTED VALUE","WILL_NEVER_IMPLEMENT"]
[]
[]
[null,"Power","FORMULA",{"$f":"POWER(B8,B9)","v":1},{"$f":"POWER(B7,B9)","v":0},{"$f":"POWER(B13,B15)","v":-1.8726591760299626E-3},{"$f":"POWER(B16,B14)","v":1},{"$f":"POWER(B14,B16)","v":-2},{"$f":"POWER(C9,D7)","v":1},{"$f":"POWER(C9,E7)","v":{"$error":"#VALUE!"}},{"$f":"POWER(E7,C9)","v":{"$error":"#VALUE!"}},{"$f":"POWER(E15,C16)","v":1},{"$f":"POWER(J11:M11,L8:M8)","v":0},{"$f":"POWER(H1066:H1069,L1068)","v":-2}]
[null,null,"EXPECTED VALUE",1,0,-1.8726591760299626E-3,1,-2,1,{"$error":"#VALUE!"},{"$error":"#VALUE!"},1,0,-2]
[]
[]
[null,"Ppmt","FORMULA"]
[null,null,"EXPECTED VALUE"]
[]
[]
[null,"Presstool","FORMULA","WILL_NEVER_IMPLEMENT"]
[null,null,"EXPECTED VALUE","WILL_NEVER_IMPLEMENT"]
[]
[]
[null,"Prob","FORMULA"]
[null,null,"EXPECTED VALUE"]
[]
[]
[null,"Product","FORMULA",{"$f":"PRODUCT(\"2\",B9:B10)","v":2136},{"$f":"PRODUCT(\"0\",B9:B15)","v":0},{"$f":"PRODUCT(B7:B17)","v":0},{"$f":"PRODUCT(0,2/0,7)","v":{"$error":"#DIV/0!"}},{"$f":"PRODUCT(B18,C14)","v":-2.99999},{"$f":"PRODUCT(C9:E9)","v":1.1},{"$f":"PRODUCT(F10:G12)","v":0},{"$f":"PRODUCT(E8:E9)","v":0},{"$f":"PRODUCT(D7:D10)","v":0}]
[null,null,"EXPECTED VALUE",2136,0,0,{"$error":"#DIV/0!"},-2.99999,1.1,0,0,0]
[]
[]
[null,"Proper","FORMULA"]
[null,null,"EXPECTED VALUE"]
[]
[]
[null,"Pv","FORMULA",{"$f":"PV(0.1, 10, B16)","v":{"v":-6.144567105704685,"d":"($6.14)"}}]
[null,null,"EXPECTED VALUE",-6.144567105704685]
[]
[]
[null,"Quartile","FORMULA"]
[null,null,"EXPECTED VALUE"]
[]
[]
[null,"Radians","FORMULA",{"$f":"RADIANS(B7)","v":0},{"$f":"RADIANS(B9)","v":0.03490658503988659},{"$f":"RADIANS(B14)","v":-0.03490658503988659},{"$f":"RADIANS(B15)","v":-0.017453292519943295},{"$f":"RADIANS(B16)","v":0.017453292519943295},{"$f":"RADIANS(D7)","v":0},{"$f":"RADIANS(E7)","v":{"$error":"#VALUE!"}},{"$f":"RADIANS(E15)","v":0.017453292519943295},{"$f":"RADIANS(J10:M10)","v":0.07853981633974483},{"$f":"RADIANS(I1098:I1101)","v":0},{"$f":"RADIANS(K8:L9)","v":{"$error":"#VALUE!"}}]
[null,null,"EXPECTED VALUE",0,0.03490658503988659,-0.03490658503988659,-0.017453292519943295,0.017453292519943295,0,{"$error":"#VALUE!"},0.017453292519943295,0.07853981633974483,0,{"$error":"#VALUE!"}]
[]
[]
[null,"Rand","FORMULA","CANNOT_TEST"]
[null,null,"EXPECTED VALUE","CANNOT_TEST"]
[]
[]
[null,"Rank","FORMULA"]
[null,null,"EXPECTED VALUE"]
[]
[]
[null,"Rate","FORMULA",{"$f":"RATE(58,-200,8000)","v":{"v":0.013541257643259374,"d":"0.013541258"}}]
[null,null,"EXPECTED VALUE",0.0135412576432592]
[]
[]
[null,"Reftext","FORMULA","WILL_NEVER_IMPLEMENT"]
[null,null,"EXPECTED VALUE","WILL_NEVER_IMPLEMENT"]
[]
[]
[null,"Register","FORMULA","WILL_NEVER_IMPLEMENT"]
[null,null,"EXPECTED VALUE","WILL_NEVER_IMPLEMENT"]
[]
[]
[null,"Registerid","FORMULA","WILL_NEVER_IMPLEMENT"]
[null,null,"EXPECTED VALUE","WILL_NEVER_IMPLEMENT"]
[]
[]
[null,"Relref","FORMULA","WILL_NEVER_IMPLEMENT"]
[null,null,"EXPECTED VALUE","WILL_NEVER_IMPLEMENT"]
[]
[]
[null,"Renamecommand","FORMULA","WILL_NEVER_IMPLEMENT"]
[null,null,"EXPECTED VALUE","WILL_NEVER_IMPLEMENT"]
[]
[]
[null,"Replace","FORMULA",{"$f":"REPLACE(\"ABCDEFG\", 2.3, 3.9, \"xx\")","v":"AxxEFG"},{"$f":"REPLACE(\"ABCDEF\", TRUE, TRUE, \"xxx\")","v":"xxxBCDEF"},{"$f":"REPLACE(\"ABCDEF\", \"3.9\", \"40\", \"x\")","v":"ABx"},{"$f":"REPLACE(12345, 3, 1, 9009)","v":"12900945"},{"$f":"REPLACE(\"ABCDEF\", -3, 4, \"xx\")","v":{"$error":"#VALUE!"}},{"$f":"REPLACE(\"ABCDEF\",#NAME?, 2, \"xx\")","v":{"$error":"#NAME?"}}]
[null,null,"EXPECTED VALUE","AxxEFG","xxxBCDEF","ABx","12900945",{"$error":"#VALUE!"},{"$error":"#NAME?"}]
[]
[]
[null,"Replaceb","FORMULA"]
[null,null,"EXPECTED VALUE"]
[]
[]
[null,"Rept","FORMULA"]
[null,null,"EXPECTED VALUE"]
[]
[]
[null,"Request","FORMULA"]
[null,null,"EXPECTED VALUE"]
[]
[]
[null,"Resettoolbar","FORMULA","WILL_NEVER_IMPLEMENT"]
[null,null,"EXPECTED VALUE","WILL_NEVER_IMPLEMENT"]
[]
[]
[null,"Restart","FORMULA","WILL_NEVER_IMPLEMENT"]
[null,null,"EXPECTED VALUE","WILL_NEVER_IMPLEMENT"]
[]
[]
[null,"Result","FORMULA"]
[null,null,"EXPECTED VALUE"]
[]
[]
[null,"Resume","FORMULA","WILL_NEVER_IMPLEMENT"]
[null,null,"EXPECTED VALUE","WILL_NEVER_IMPLEMENT"]
[]
[]
[null,"Right","FORMULA",{"$f":"RIGHT(\"a string\",0)","v":""},{"$f":"RIGHT(\"a string\",\"6\")","v":"string"},{"$f":"RIGHT(\"a string\",10)","v":"a string"},{"$f":"RIGHT(\"a string\",B9)","v":"ng"},{"$f":"RIGHT(E11, E17)","v":"ce"},{"$f":"RIGHT(TRUE,2)","v":"UE"},{"$f":"RIGHT(G367:H369,H370)","v":{"$error":"#VALUE!"}},{"$f":"RIGHT(\"a string\", TRUE)","v":"g"}]
[null,null,"EXPECTED VALUE","","string","a string","ng","ce","UE",{"$error":"#VALUE!"},"g"]
[]
[]
[null,"Rightb","FORMULA"]
[null,null,"EXPECTED VALUE"]
[]
[]
[null,"Roman","FORMULA"]
[null,null,"EXPECTED VALUE"]
[]
[]
[null,"Round","FORMULA",{"$f":"ROUND(B9,B8)","v":2},{"$f":"ROUND(C10,C9)","v":1},{"$f":"ROUND(C15,C16)","v":0},{"$f":"ROUND(C15,C9)","v":-1},{"$f":"ROUND(C11,C17)","v":3},{"$f":"ROUND(C7,C7)","v":0},{"$f":"ROUND(D7,D8)","v":0},{"$f":"ROUND(E7,C7)","v":{"$error":"#VALUE!"}},{"$f":"ROUND(C7,E7)","v":{"$error":"#VALUE!"}},{"$f":"ROUND(F13,F8)","v":3},{"$f":"ROUND(M9:O9,K10)","v":345},{"$f":"ROUND(N10,K10)","v":0},{"$f":"ROUND(N1178:N1181,O10)","v":345}]
[null,null,"EXPECTED VALUE",2,1,0,-1,3,0,0,{"$error":"#VALUE!"},{"$error":"#VALUE!"},3,345,0,345]
[]
[]
[null,"Rounddown","FORMULA",{"$f":"ROUNDDOWN(1.5,0)","v":1},{"$f":"ROUNDDOWN(1.567,2)","v":1.56},{"$f":"ROUNDDOWN(B13,-1)","v":-530},{"$f":"ROUNDDOWN(C11,1)","v":2.9},{"$f":"ROUNDDOWN(D7,-1)","v":0},{"$f":"ROUNDDOWN(E13,0)","v":0},{"$f":"ROUNDDOWN(E17,2)","v":2.99},{"$f":"ROUNDDOWN(E7,1)","v":{"$error":"#VALUE!"}},{"$f":"ROUNDDOWN(F13,3)","v":2.999},{"$f":"ROUNDDOWN(G7:I7,3)","v":{"$error":"#VALUE!"}},{"$f":"ROUNDDOWN(L9:O9,-2)","v":300},{"$f":"ROUNDDOWN(N1184:N1186,-2)","v":300},{"$f":"ROUNDDOWN(K8:L9,2)","v":{"$error":"#VALUE!"}}]
[null,null,"EXPECTED VALUE",1,1.56,-530,2.9,0,0,2.99,{"$error":"#VALUE!"},2.999,{"$error":"#VALUE!"},300,300,{"$error":"#VALUE!"}]
[]
[]
[null,"Roundup","FORMULA",{"$f":"ROUNDUP(0,0)","v":0},{"$f":"ROUNDUP(B10,-2)","v":600},{"$f":"ROUNDUP(B13,-2)","v":-600},{"$f":"ROUNDUP(B16,0)","v":1},{"$f":"ROUNDUP(B17,-1)","v":0},{"$f":"ROUNDUP(C8,-1)","v":10},{"$f":"ROUNDUP(E7,0)","v":{"$error":"#VALUE!"}},{"$f":"ROUNDUP(E17,3)","v":3},{"$f":"ROUNDUP(G9:I9,2)","v":{"$error":"#VALUE!"}},{"$f":"ROUNDUP(K8:N8,2)","v":3},{"$f":"ROUNDUP(K1187:K1189,1)","v":3},{"$f":"ROUNDUP(N8:O10,0)","v":{"$error":"#VALUE!"}}]
[null,null,"EXPECTED VALUE",0,600,-600,1,0,10,{"$error":"#VALUE!"},3,{"$error":"#VALUE!"},3,3,{"$error":"#VALUE!"}]
[]
[]
[null,"Row","FORMULA",{"$f":"ROW(E17)","v":17},{"$f":"ROW(C13)","v":13},{"$f":"ROW(2:3)","v":2},{"$f":"ROW(C11:C14)","v":11},{"$f":"ROW(C13:E13)","v":13},{"$f":"ROW(C14:E17)","v":14},{"$f":"ROW(J1188)","v":1188},{"$f":"ROW(D13:E17)","v":13}]
[null,null,"EXPECTED VALUE",17,13,2,11,13,14,1188,13]
[]
[]
[null,"Rows","FORMULA",{"$f":"ROWS(B6:D10)","v":5}]
[null,null,"EXPECTED VALUE",5]
[]
[]
[null,"Rsq","FORMULA"]
[null,null,"EXPECTED VALUE"]
[]
[]
[null,"Savedialog","FORMULA","WILL_NEVER_IMPLEMENT"]
[null,null,"EXPECTED VALUE","WILL_NEVER_IMPLEMENT"]
[]
[]
[null,"Savetoolbar","FORMULA","WILL_NEVER_IMPLEMENT"]
[null,null,"EXPECTED VALUE","WILL_NEVER_IMPLEMENT"]
[]
[]
[null,"Scenarioget","FORMULA","WILL_NEVER_IMPLEMENT"]
[null,null,"EXPECTED VALUE","WILL_NEVER_IMPLEMENT"]
[]
[]
[null,"Search","FORMULA",{"$f":"SEARCH(\"n\",\"printer\")","v":4},{"$f":"SEARCH(\"s\",$E$8)","v":3},{"$f":"SEARCH(\"S\",$E$8)","v":3},{"$f":"SEARCH(\"S\",$E$8, 4)","v":8},{"$f":"SEARCH(B8,C8)","v":7}]
[null,null,"EXPECTED VALUE",4,3,3,8,7]
[]
[]
[null,"Searchb","FORMULA"]
[null,null,"EXPECTED VALUE"]
[]
[]
[null,"Second","FORMULA",{"$f":"SECOND(0.5)","v":0},{"$f":"SECOND(TIME(0,0,15))","v":15},{"$f":"SECOND(E11)","v":{"$error":"#VALUE!"}}]
[null,null,"EXPECTED VALUE",0,15,{"$error":"#VALUE!"}]
[]
[]
[null,"Selection","FORMULA"]
[null,null,"EXPECTED VALUE"]
[]
[]
[null,"Series","FORMULA"]
[null,null,"EXPECTED VALUE"]
[]
[]
[null,"Setname","FORMULA","WILL_NEVER_IMPLEMENT"]
[null,null,"EXPECTED VALUE","WILL_NEVER_IMPLEMENT"]
[]
[]
[null,"Setvalue","FORMULA","WILL_NEVER_IMPLEMENT"]
[null,null,"EXPECTED VALUE","WILL_NEVER_IMPLEMENT"]
[]
[]
[null,"Showbar","FORMULA","WILL_NEVER_IMPLEMENT"]
[null,null,"EXPECTED VALUE","WILL_NEVER_IMPLEMENT"]
[]
[]
[null,"Sign","FORMULA",{"$f":"SIGN(B7)","v":0},{"$f":"SIGN(D7)","v":0},{"$f":"SIGN(B11)","v":1},{"$f":"SIGN(B12)","v":-1},{"$f":"SIGN(B16)","v":1},{"$f":"SIGN(B17)","v":0},{"$f":"SIGN(C15)","v":-1},{"$f":"SIGN(E16)","v":1},{"$f":"SIGN(E7)","v":{"$error":"#VALUE!"}},{"$f":"SIGN(J8:M8)","v":1},{"$f":"SIGN(J1246:J1249)","v":-1},{"$f":"SIGN(N9:O10)","v":{"$error":"#VALUE!"}}]
[null,null,"EXPECTED VALUE",0,0,1,-1,1,0,-1,1,{"$error":"#VALUE!"},1,-1,{"$error":"#VALUE!"}]
[]
[]
[null,"Sin","FORMULA",{"$f":"SIN(B7)","v":0},{"$f":"SIN(B8)","v":0.8414709848078965},{"$f":"SIN(B9)","v":0.9092974268256817},{"$f":"SIN(B13)","v":0.07069209833337337},{"$f":"SIN(B16)","v":0.8414709848078965},{"$f":"SIN(B18)","v":{"$error":"#VALUE!"}},{"$f":"SIN(C15)","v":-0.8414763877888816},{"$f":"SIN(E7)","v":{"$error":"#VALUE!"}},{"$f":"SIN(E16)","v":0.8912073600614354},{"$f":"SIN(K8:M8)","v":0.1411200080598672},{"$f":"SIN(L1251:L1253)","v":0.777831107909478},{"$f":"SIN(N8:O9)","v":{"$error":"#VALUE!"}},{"$f":"SIN(E15)","v":0.8414709848078965}]
[null,null,"EXPECTED VALUE",0,0.8414709848078965,0.9092974268256817,0.07069209833337337,0.8414709848078965,{"$error":"#VALUE!"},-0.8414763877888816,{"$error":"#VALUE!"},0.8912073600614354,0.1411200080598672,0.777831107909478,{"$error":"#VALUE!"},0.8414709848078965]
[]
[]
[null,"Sinh","FORMULA",{"$f":"SINH(B7)","v":0},{"$f":"SINH(B9)","v":3.626860407847019},{"$f":"SINH(B14)","v":-3.626860407847019},{"$f":"SINH(B16)","v":1.1752011936438014},{"$f":"SINH(B18)","v":{"$error":"#VALUE!"}},{"$f":"SINH(D7)","v":0},{"$f":"SINH(E7)","v":{"$error":"#VALUE!"}},{"$f":"SINH(E15)","v":1.1752011936438014},{"$f":"SINH(F8)","v":1.1752011936438014},{"$f":"SINH(K8:M8)","v":10.017874927409903},{"$f":"SINH(L1255:L1257)","v":1.4650188248182272},{"$f":"SINH(N8:O9)","v":{"$error":"#VALUE!"}}]
[null,null,"EXPECTED VALUE",0,3.626860407847019,-3.626860407847019,1.1752011936438014,{"$error":"#VALUE!"},0,{"$error":"#VALUE!"},1.1752011936438014,1.1752011936438014,10.017874927409903,1.4650188248182272,{"$error":"#VALUE!"}]
[]
[]
[null,"Skew","FORMULA"]
[null,null,"EXPECTED VALUE"]
[]
[]
[null,"Sln","FORMULA"]
[null,null,"EXPECTED VALUE"]
[]
[]
[null,"Slope","FORMULA"]
[null,null,"EXPECTED VALUE"]
[]
[]
[null,"Small","FORMULA",{"$f":"SMALL(B7:B17,5)","v":0},{"$f":"SMALL(C7:C14,6)","v":1.1},{"$f":"SMALL(C7:D11,3)","v":1.00001},{"$f":"SMALL(D7:E10,2)","v":{"$error":"#NUM!"}},{"$f":"SMALL(E8:F10,3)","v":9999999999},{"$f":"SMALL(C10:D15,4)","v":1.00001},{"$f":"SMALL(E10:F11,1)","v":0},{"$f":"SMALL(C7:C10,100)","v":{"$error":"#NUM!"}}]
[null,null,"EXPECTED VALUE",0,1.1,1.00001,{"$error":"#NUM!"},9999999999,1.00001,0,{"$error":"#NUM!"}]
[]
[]
[null,"Spellingcheck","FORMULA","WILL_NEVER_IMPLEMENT"]
[null,null,"EXPECTED VALUE","WILL_NEVER_IMPLEMENT"]
[]
[]
[null,"Sqrt","FORMULA",{"$f":"SQRT(16)","v":4},{"$f":"SQRT(B7)","v":0},{"$f":"SQRT(B8)","v":1},{"$f":"SQRT(C9)","v":1.0488088481701516},{"$f":"SQRT(C16)","v":{"$error":"#NUM!"}},{"$f":"SQRT(-4)","v":{"$error":"#NUM!"}},{"$f":"SQRT(B16)","v":1},{"$f":"SQRT(E13)","v":0},{"$f":"SQRT(E7)","v":{"$error":"#VALUE!"}},{"$f":"SQRT(K13)","v":0},{"$f":"SQRT(L10:N10)","v":3.1622776601683794E-3},{"$f":"SQRT(J1279:J1281)","v":1},{"$f":"SQRT(O7:P8)","v":{"$error":"#VALUE!"}}]
[null,null,"EXPECTED VALUE",4,0,1,1.0488088481701516,{"$error":"#NUM!"},{"$error":"#NUM!"},1,0,{"$error":"#VALUE!"},0,3.1622776601683794E-3,1,{"$error":"#VALUE!"}]
[]
[]
[null,"Standardize","FORMULA"]
[null,null,"EXPECTED VALUE"]
[]
[]
[null,"Stdev","FORMULA",{"$f":"STDEV(B7:B9,C7:C9,C10:C11)","v":1.0696254184317784},{"$f":"STDEV(B14:B16,D15:D17,E15)","v":0.7071067811865476},{"$f":"STDEV(E15:E17)","v":{"$error":"#DIV/0!"}},{"$f":"STDEV(\"1\",\"2\")","v":0.7071067811865476},{"$f":"STDEV(D14:D15,E13)","v":{"$error":"#DIV/0!"}},{"$f":"STDEV(F10,F8)","v":0.7070997101187356},{"$f":"STDEV(F8:G10)","v":4472135954.066401},{"$f":"STDEV(TRUE, FALSE, TRUE)","v":0.5773502691896258},{"$f":"STDEV(1,2,3,E20)","v":1}]
[null,null,"EXPECTED VALUE",1.0696254184317784,0.7071067811865476,{"$error":"#DIV/0!"},0.7071067811865476,{"$error":"#DIV/0!"},0.7070997101187356,4472135954.066401,0.5773502691896258,1]
[]
[]
[null,"Stdeva","FORMULA"]
[null,null,"EXPECTED VALUE"]
[]
[]
[null,"Stdevp","FORMULA"]
[null,null,"EXPECTED VALUE"]
[]
[]
[null,"Stdevpa","FORMULA"]
[null,null,"EXPECTED VALUE"]
[]
[]
[null,"Step","FORMULA"]
[null,null,"EXPECTED VALUE"]
[]
[]
[null,"Steyx","FORMULA"]
[null,null,"EXPECTED VALUE"]
[]
[]
[null,"Substitute","FORMULA",{"$f":"SUBSTITUTE(E12,\"n\",\"N\")","v":"NoN-Numeric"},{"$f":"SUBSTITUTE(\"ISCASESENSITIVE\",\"case\",\"CASE\")","v":"ISCASESENSITIVE"},{"$f":"SUBSTITUTE(\"teststr\",\"t\",\"T\",1.9)","v":"Teststr"},{"$f":"SUBSTITUTE(\"teststr\",\"t\",\"T\",0)","v":{"$error":"#VALUE!"}},{"$f":"SUBSTITUTE(\"teststr\",\"z\",\"T\",1)","v":"teststr"},{"$f":"SUBSTITUTE(\"testaatestbbtestcc\",\"test\",\"testtest\")","v":"testtestaatesttestbbtesttestcc"},null,{"$f":"SUBSTITUTE(\"matchlastchar\", \"r\", \"R\")","v":"matchlastchaR"},{"$f":"SUBSTITUTE(\"nomatch\", \"zzz\", \"ZZZ\")","v":"nomatch"},{"$f":"SUBSTITUTE(\"regex**chars\", \"*\", \"T\")","v":"regexTTchars"},{"$f":"SUBSTITUTE(\"1.11\", \"1\", \"2\", 1)","v":"2.11"},{"$f":"SUBSTITUTE(E7, \"1\", \"2\", 1)","v":""},{"$f":"SUBSTITUTE(\"testblankmatch\", \"\", \"!\", 1)","v":"testblankmatch"},{"$f":"SUBSTITUTE(\"   \", \" \", \"*\")","v":"***"},{"$f":"SUBSTITUTE(\"testblanknewstr\", \"t\", E7)","v":"esblanknewsr"},{"$f":"SUBSTITUTE(\"   \", \" \", \"\")","v":""},{"$f":"SUBSTITUTE(\"   \", \" \", \"\", 1)","v":"  "},{"$f":"SUBSTITUTE(\"ABCBBDBEB\", \"B\", \"x\", 1)","v":"AxCBBDBEB"},{"$f":"SUBSTITUTE(\"ABCBBDBEB\", \"B\", \"x\", 0)","v":{"$error":"#VALUE!"}},{"$f":"SUBSTITUTE(\"ABCBBDBEB\", \"B\", \"x\", -1)","v":{"$error":"#VALUE!"}},{"$f":"SUBSTITUTE(\"ABCBBDBEB\", \"B\", \"x\", 3)","v":"ABCBxDBEB"},{"$f":"SUBSTITUTE(\"ABCBBDBEB\", \"B\", \"x\", 7)","v":"ABCBBDBEB"}]
[null,null,"EXPECTED VALUE","NoN-Numeric","ISCASESENSITIVE","Teststr",{"$error":"#VALUE!"},"teststr","testtestaatesttestbbtesttestcc",null,"matchlastchaR","nomatch","regexTTchars","2.11","","testblankmatch","***","esblanknewsr","","  ","AxCBBDBEB",{"$error":"#VALUE!"},{"$error":"#VALUE!"},"ABCBxDBEB","ABCBBDBEB"]
[]
[]
[null,"Subtotal","FORMULA",{"$f":"SUBTOTAL(9,B7:B9)","v":3},{"$f":"SUBTOTAL(1,$B$7:$B$9)","v":1},{"$f":"SUBTOTAL(2,$B$7:$B$9)","v":3},{"$f":"SUBTOTAL(4,$B$7:$B$9)","v":2},{"$f":"SUBTOTAL(5,$B$7:$B$9)","v":0}]
[null,null,"EXPECTED VALUE",3,1,3,2,0]
[]
[]
[null,"Sum","FORMULA",{"$f":"SUM(B8:B11,C10,E17,E14,D16,B16,B18)","v":10000000537.00001},{"$f":"SUM(B8:E10,E9:E16,G12)","v":539.10002},{"$f":"SUM(F13,F10)","v":1e-05},{"$f":"SUM(E15:E17)","v":0},{"$f":"SUM(\"-23\",E15,C13:C15,B9:D9)","v":-1000023.8999900001},{"$f":"SUM(G8:I10,I12,J11,J10)","v":475.98121},{"$f":"SUM(\"1\", \"1.1\", \"2.99999\")","v":5.09999}]
[null,null,"EXPECTED VALUE",10000000537.00001,539.10002,1e-05,0,-1000023.8999900001,475.98121,5.09999]
[]
[]
[null,"Sumif","FORMULA",{"$f":"SUMIF(G7:J9, \"<3\")","v":9.345600000000001},{"$f":"SUMIF(AA7:AA13,C10:D10, C7)","v":1.1}]
[null,null,"EXPECTED VALUE",9.3456,1.1]
[]
[]
[null,"Sumproduct","FORMULA",{"$f":"SUMPRODUCT(B8:B9)","v":3},{"$f":"SUMPRODUCT(B8:B10,C8:C10)","v":536.2053500000001},{"$f":"SUMPRODUCT(B9:B10,C9:C10)","v":536.2053400000001},{"$f":"SUMPRODUCT(3,B10,C9)","v":1762.2},{"$f":"SUMPRODUCT(C9:C9,3,B10,C9:C9)","v":1938.4200000000003},{"$f":"SUMPRODUCT(2, C10:C11)","v":{"$error":"#VALUE!"}},{"$f":"SUMPRODUCT(G1330:G1330,I1330:I1330)","v":{"$error":"#VALUE!"}},{"$f":"SUMPRODUCT(I1330:J1330,K1330:L1330)","v":{"$error":"#REF!"}},{"$f":"SUMPRODUCT(K1330,J1330)","v":{"$error":"#REF!"}}]
[null,null,"EXPECTED VALUE",3,536.2053500000001,536.2053400000001,1762.2,1938.4200000000003,{"$error":"#VALUE!"},{"$error":"#VALUE!"},{"$error":"#REF!"},{"$error":"#REF!"}]
[{"$nulls":6},"4",null,2,3,{"$f":"AA10","v":{"$error":"#REF!"}},5]
[]
[null,"Sumsq","FORMULA",{"$f":"SUMSQ(B8:B10)","v":285161},{"$f":"SUMSQ(C7:C11)","v":11.209960000299999},{"$f":"SUMSQ(C7:D9)","v":1.2100000001000002},{"$f":"SUMSQ(C11,C10,C9,D15)","v":11.209960000199999},{"$f":"SUMSQ(B8:D9,E15,F13)","v":6.2100000001},{"$f":"SUMSQ(G8:I9)","v":71.94652146},{"$f":"SUMSQ(E13:F14)","v":0},{"$f":"SUMSQ(E13:E16)","v":0},{"$f":"SUMSQ(F10:I14)","v":622175.0000000001},{"$f":"SUMSQ(TRUE, TRUE, FALSE)","v":2},{"$f":"SUMSQ(\"2\", \"3\", 4)","v":29}]
[null,null,"EXPECTED VALUE",285161,11.209960000299999,1.2100000001000002,11.209960000199999,6.2100000001,71.94652146,0,0,622175,2,29]
[]
[]
[null,"Sumx2my2","FORMULA",{"$f":"SUMX2MY2(B7:C10,C8:D11)","v":285149.7900399997},{"$f":"SUMX2MY2(D8:E11,C8:D11)","v":{"$error":"#DIV/0!"}},{"$f":"SUMX2MY2(G7:I9,H7:J9)","v":-74.83668064},{"$f":"SUMX2MY2(E8:E14,F8:F14)","v":{"$error":"#DIV/0!"}},{"$f":"SUMX2MY2(B8:B10,G8:I8)","v":285138.753998},{"$f":"SUMX2MY2(G8:G11,H8:H11)","v":-14.438935530000002},{"$f":"SUMX2MY2(H8:H10,G7:G8)","v":{"$error":"#N/A"}},{"$f":"SUMX2MY2(G8,H8)","v":-7.992000000000001},{"$f":"SUMX2MY2(AC7:AJ12,AD7:AK12)","v":-2304},{"$f":"SUMX2MY2(AA10:AA11,AA11:AA12)","v":{"$error":"#REF!"}}]
[null,null,"EXPECTED VALUE",285149.7900399997,{"$error":"#DIV/0!"},-74.83668064,{"$error":"#DIV/0!"},285138.753998,-14.438935530000002,{"$error":"#N/A"},-7.992000000000001,-2304,{"$error":"#REF!"}]
[]
[]
[null,"Sumx2py2","FORMULA",{"$f":"SUMX2PY2(B7:B10,C8:C11)","v":285172.2099600003},{"$f":"SUMX2PY2(C8:C10,B15:D15)","v":3.2100200002},{"$f":"SUMX2PY2(B16:D16,B16:B18)","v":{"$error":"#DIV/0!"}},{"$f":"SUMX2PY2(B14:B16,E15:E17)","v":{"$error":"#DIV/0!"}},{"$f":"SUMX2PY2(B7:B9,B16:D16)","v":2.21},{"$f":"SUMX2PY2(G7:H9,H7:I9)","v":110.88929734999999},{"$f":"SUMX2PY2(G7:H9,J7:J12)","v":105.7931362501},{"$f":"SUMX2PY2(E7:E10,D7:D10)","v":{"$error":"#DIV/0!"}}]
[null,null,"EXPECTED VALUE",285172.2099600003,3.2100200002,{"$error":"#DIV/0!"},{"$error":"#DIV/0!"},2.21,110.88929734999999,105.7931362501,{"$error":"#DIV/0!"}]
[]
[]
[null,"Sumxmy2","FORMULA",{"$f":"SUMXMY2(B7:B10,C7:C10)","v":284090.7993200002},{"$f":"SUMXMY2(C11:C13,B13:B15)","v":2000002288333.9893},{"$f":"SUMXMY2(2,4)","v":4},{"$f":"SUMXMY2(D7:D11,C8:C12)","v":{"$error":"#DIV/0!"}},{"$f":"SUMXMY2(C7:C10,C7:C9)","v":{"$error":"#N/A"}},{"$f":"SUMXMY2(E14:E17,C9:C12)","v":{"$error":"#DIV/0!"}},{"$f":"SUMXMY2(E15:E16,C15:C16)","v":{"$error":"#DIV/0!"}}]
[null,null,"EXPECTED VALUE",284090.7993200002,2000002288333.9893,4,{"$error":"#DIV/0!"},{"$error":"#N/A"},{"$error":"#DIV/0!"},{"$error":"#DIV/0!"}]
[]
[]
[null,"Syd","FORMULA"]
[null,null,"EXPECTED VALUE"]
[]
[]
[null,"T","FORMULA",{"$f":"T(\"\")","v":""},{"$f":"T(B10)","v":""},{"$f":"T(B16)","v":""},{"$f":"T(B18)","v":"TRUE"},{"$f":"T(D8)","v":""},{"$f":"T(C11)","v":""},{"$f":"T(E12)","v":"non-numeric"},{"$f":"T(E16)","v":"1.1"},{"$f":"T(F13)","v":"2.99999"},{"$f":"T(H12:J12)","v":""},{"$f":"T(L7:N7)","v":""},{"$f":"T(J1351:J1353)","v":""}]
[null,null,"EXPECTED VALUE","","","","TRUE","","","non-numeric","1.1","2.99999","","",""]
[]
[]
[null,"Tan","FORMULA",{"$f":"TAN(B7)","v":0},{"$f":"TAN(C9)","v":1.9647596572486523},{"$f":"TAN(B14)","v":2.185039863261519},{"$f":"TAN(B16)","v":1.5574077246549023},{"$f":"TAN(D7)","v":0},{"$f":"TAN(E7)","v":{"$error":"#VALUE!"}},{"$f":"TAN(E15)","v":1.5574077246549023},{"$f":"TAN(I7:L7)","v":1.5574077246549023},{"$f":"TAN(J1356:J1357)","v":74.68593339876537},{"$f":"TAN(L7:M8)","v":{"$error":"#VALUE!"}}]
[null,null,"EXPECTED VALUE",0,1.9647596572486523,2.185039863261519,1.5574077246549023,0,{"$error":"#VALUE!"},1.5574077246549023,1.5574077246549023,74.68593339876537,{"$error":"#VALUE!"}]
[]
[]
[null,"Tanh","FORMULA",{"$f":"TANH(B7)","v":0},{"$f":"TANH(B8:C9)","v":{"$error":"#VALUE!"}},{"$f":"TANH(C14)","v":-0.9950546550253772},{"$f":"TANH(F1358:F1361)","v":-0.7595094030507608},{"$f":"TANH(F7:H7)","v":0.964027580075817},{"$f":"TANH(H1358:H1361)","v":0.7460679984455995},{"$f":"TANH(E16)","v":0.8004990217606297},{"$f":"TANH(B16)","v":0.7615941559557649},{"$f":"TANH(B18)","v":{"$error":"#VALUE!"}},{"$f":"TANH(K7:L8)","v":{"$error":"#VALUE!"}},{"$f":"TANH(I8:K8)","v":{"$error":"#VALUE!"}}]
[null,null,"EXPECTED VALUE",0,{"$error":"#VALUE!"},-0.9950546550253772,-0.7595094030507609,0.964027580075817,0.7460679984455995,0.8004990217606297,0.7615941559557649,{"$error":"#VALUE!"},{"$error":"#VALUE!"},{"$error":"#VALUE!"}]
[]
[]
[null,"Tdist","FORMULA"]
[null,null,"EXPECTED VALUE"]
[]
[]
[null,"Terminate","FORMULA","WILL_NEVER_IMPLEMENT"]
[null,null,"EXPECTED VALUE","WILL_NEVER_IMPLEMENT"]
[]
[]
[null,"Text","FORMULA",{"$f":"TEXT(B9,\"0%\")&\"'\"","v":"200%'"},{"$f":"TEXT(321.321111111111,\"#.##\")&\"'\"","v":"321.32'"},{"$f":"TEXT(B10,\"$#,##0.00\")&\"'\"","v":"$534.00'"}]
[null,null,"EXPECTED VALUE","200%'","321.32'","$534.00'"]
[]
[]
[null,"Textbox","FORMULA","WILL_NEVER_IMPLEMENT"]
[null,null,"EXPECTED VALUE","WILL_NEVER_IMPLEMENT"]
[]
[]
[null,"Textref","FORMULA","WILL_NEVER_IMPLEMENT"]
[null,null,"EXPECTED VALUE","WILL_NEVER_IMPLEMENT"]
[]
[]
[null,"Time","FORMULA",{"$f":"TIME(12,0,0)","v":{"v":0.5,"d":"0.5000"}},{"$f":"TIME(27,0,0)","v":{"v":0.125,"d":"0.1250"}}]
[null,null,"EXPECTED VALUE",{"v":0.5,"d":"0.5000"},{"v":0.125,"d":"0.1250"}]
[]
[]
[null,"Timevalue","FORMULA"]
[null,null,"EXPECTED VALUE"]
[]
[]
[null,"Tinv","FORMULA"]
[null,null,"EXPECTED VALUE"]
[]
[]
[null,"Today","FORMULA"]
[null,null,"EXPECTED VALUE"]
[]
[]
[null,"Transpose","FORMULA"]
[null,null,"EXPECTED VALUE"]
[]
[]
[null,"Trend","FORMULA"]
[null,null,"EXPECTED VALUE"]
[]
[]
[null,"Trim","FORMULA",{"$f":"TRIM(E7)","v":""},{"$f":"TRIM(E8)","v":"nospaces"},{"$f":"TRIM(E9)","v":"sp ace s"},{"$f":"TRIM(E10)","v":"endsWithSpace"},{"$f":"TRIM(E11)","v":"beginsWithSpace"},{"$f":"TRIM(E12)","v":"non-numeric"},{"$f":"TRIM(E13)","v":"0"},{"$f":"TRIM(E14)","v":"0.000001"},{"$f":"TRIM(E15)","v":"1"},{"$f":"TRIM(E16)","v":"1.1"},{"$f":"TRIM(E17)","v":"2.99999"},{"$f":"TRIM(E18)","v":"99999999"},{"$f":"TRIM(E19)","v":"alph4Num3ric"},{"$f":"TRIM(E20)","v":""},{"$f":"TRIM(E7:E8)","v":{"$error":"#VALUE!"}},{"$f":"TRIM(9)","v":"9"}]
[null,null,"EXPECTED VALUE","","nospaces","sp ace s","endsWithSpace","beginsWithSpace","non-numeric","0","0.000001","1","1.1","2.99999","99999999","alph4Num3ric","",{"$error":"#VALUE!"},"9"]
[]
[]
[null,"Trimmean","FORMULA"]
[null,null,"EXPECTED VALUE"]
[]
[]
[null,"True","FORMULA",{"$f":"TRUE()","v":true}]
[null,null,"EXPECTED VALUE",true]
[]
[]
[null,"Trunc","FORMULA",{"$f":"TRUNC(8.9)","v":8},{"$f":"TRUNC(8.9,1)","v":8.9},{"$f":"TRUNC(-8.9)","v":-8},{"$f":"TRUNC(PI())","v":3}]
[null,null,"EXPECTED VALUE",8,8.9,-8,3]
[]
[]
[null,"Ttest","FORMULA"]
[null,null,"EXPECTED VALUE"]
[]
[]
[null,"Type","FORMULA"]
[null,null,"EXPECTED VALUE"]
[]
[]
[null,"Unregister","FORMULA","WILL_NEVER_IMPLEMENT"]
[null,null,"EXPECTED VALUE","WILL_NEVER_IMPLEMENT"]
[]
[]
[null,"Upper","FORMULA",{"$f":"UPPER(\"this is all lower\")","v":"THIS IS ALL LOWER"},{"$f":"UPPER(\"123 456\")","v":"123 456"},{"$f":"UPPER(\"ASDFGH\")","v":"ASDFGH"},{"$f":"UPPER(123)","v":"123"},{"$f":"UPPER(B10)","v":"534"},{"$f":"UPPER(B16)","v":"TRUE"},{"$f":"UPPER(B18)","v":"TRUE"},{"$f":"UPPER(E11)","v":" BEGINSWITHSPACE"},{"$f":"UPPER(E19)","v":"ALPH4NUM3RIC"},{"$f":"UPPER(K7:N7)","v":"ALPHANUM"},{"$f":"UPPER(L1434:L1437)","v":"ALPH4NUM3RIC"},{"$f":"UPPER(N7:P8)","v":{"$error":"#VALUE!"}},{"$f":"UPPER(M9:N10)","v":{"$error":"#VALUE!"}},{"$f":"UPPER(AA12)","v":{"$error":"#NUM!"}},{"$f":"UPPER(misc!R1000:R2000)","v":""}]
[null,null,"EXPECTED VALUE","THIS IS ALL LOWER","123 456","ASDFGH","123","534","TRUE","TRUE"," BEGINSWITHSPACE","ALPH4NUM3RIC","ALPHANUM","ALPH4NUM3RIC",{"$error":"#VALUE!"},{"$error":"#VALUE!"},{"$error":"#NUM!"},""]
[]
[]
[null,"Usdollar","FORMULA"]
[null,null,"EXPECTED VALUE"]
[]
[]
[null,"Value","FORMULA",{"$f":"VALUE(\"0.33\")","v":0.33},{"$f":"VALUE(\"$1,000\")","v":1000}]
[null,null,"EXPECTED VALUE",0.33,1000]
[]
[]
[null,"Var","FORMULA",{"$f":"VAR(B7:B9,C7:C9,C10:C11)","v":1.1440985357553568},{"$f":"VAR(B14:B16,D15:D17,E15)","v":0.5},{"$f":"VAR(E15:E17)","v":{"$error":"#DIV/0!"}},{"$f":"VAR(\"1\",\"2\")","v":0.5},{"$f":"VAR(D14:D15,E13)","v":{"$error":"#DIV/0!"}},{"$f":"VAR(F10,F8)","v":0.49999000004999994},{"$f":"VAR(F8:G10)","v":1.9999999991653392E+19},{"$f":"VAR(TRUE, FALSE, TRUE)","v":0.33333333333333337},{"$f":"VAR(1,2,3,E20)","v":1}]
[null,null,"EXPECTED VALUE",1.144098536,0.5,{"$error":"#DIV/0!"},0.5,{"$error":"#DIV/0!"},0.49999,{"v":2E+19,"d":"2.00E+19"},0.333333333,1]
[]
[]
[null,"Vara","FORMULA"]
[null,null,"EXPECTED VALUE"]
[]
[]
[null,"Varp","FORMULA",{"$f":"VARP(B7:B9,C7:C9,C10:C11)","v":1.0010862187859373},{"$f":"VARP(B14:B16,D15:D17,E15)","v":0.25},{"$f":"VARP(E15:E17)","v":{"$error":"#DIV/0!"}},{"$f":"VARP(\"1\",\"2\")","v":0.25},{"$f":"VARP(D14:D15,E13)","v":{"$error":"#DIV/0!"}},{"$f":"VARP(F10,F8)","v":0.24999500002499997},{"$f":"VARP(F8:G10)","v":1.5999999993322713E+19},{"$f":"VARP(TRUE, FALSE, TRUE)","v":0.2222222222222222},{"$f":"VARP(1,2,3,E28)","v":0.6666666666666666}]
[null,null,"EXPECTED VALUE",1.001086219,0.25,{"$error":"#DIV/0!"},0.25,{"$error":"#DIV/0!"},0.249995,{"v":1.6E+19,"d":"1.60E+19"},0.222222222,0.666666667]
[]
[]
[null,"Varpa","FORMULA"]
[null,null,"EXPECTED VALUE"]
[]
[]
[null,"Vdb","FORMULA"]
[null,null,"EXPECTED VALUE"]
[]
[]
[null,"Viewget","FORMULA","WILL_NEVER_IMPLEMENT"]
[null,null,"EXPECTED VALUE","WILL_NEVER_IMPLEMENT"]
[]
[]
[null,"Vlookup","FORMULA",{"$f":"VLOOKUP(534,$B$6:$H$12,2)","v":1.00001},{"$f":"VLOOKUP(534,$B$6:$H$12,4)","v":"endsWithSpace "},{"$f":"VLOOKUP(534,$B$6:$H$12,4, TRUE)","v":"endsWithSpace "},{"$f":"VLOOKUP(-1,$B$6:$H$12,4, TRUE)","v":{"$error":"#N/A"}}]
[null,null,"EXPECTED VALUE",1.00001,"endsWithSpace ","endsWithSpace ",{"$error":"#N/A"}]
[]
[]
[null,"Volatile","FORMULA"]
[null,null,"EXPECTED VALUE"]
[]
[]
[null,"Weekday","FORMULA"]
[null,null,"EXPECTED VALUE"]
[]
[]
[null,"Weibull","FORMULA"]
[null,null,"EXPECTED VALUE"]
[]
[]
[null,"Windows","FORMULA","WILL_NEVER_IMPLEMENT"]
[null,null,"EXPECTED VALUE","WILL_NEVER_IMPLEMENT"]
[]
[]
[null,"Windowtitle","FORMULA","WILL_NEVER_IMPLEMENT"]
[null,null,"EXPECTED VALUE","WILL_NEVER_IMPLEMENT"]
[]
[]
[null,"Year","FORMULA",{"$f":"YEAR(C20)","v":2000},{"$f":"YEAR(1)","v":1900},{"$f":"YEAR(0)","v":1900},{"$f":"YEAR(-10)","v":{"$error":"#NUM!"}},{"$f":"YEAR(#REF!)","v":{"$error":"#REF!"}},{"$f":"YEAR(C20+2000)","v":2006}]
[null,null,"EXPECTED VALUE",2000,1900,1900,{"$error":"#NUM!"},{"$error":"#REF!"},2006]
[]
[]
[null,"Ztest","FORMULA"]
[null,null,"EXPECTED VALUE"]
[]
[]
[null,"<END-OF-FUNCTIONS>"]

{"sheet":"FinanceLibTests","index":1,"n_rows":34,"n_cols":24,"rows_kept":34}
[{"$nulls":14},"NPV","r"]
["f","r","n","y","p","t",null,"f","p","y","n",{"$nulls":3},{"$f":"NPV(P2,R2:U2)","v":{"v":162.5,"d":"162.500000000000000"}},{"v":1,"d":"1.000000000000000"},"v[]",100,200,300,400]
[null,1,10,100,10000,0,null,{"$f":"FV(B3,C3,D3,E3,F3)","v":{"v":-10342300,"d":"-10342300.000000000000000"}},{"$nulls":6},{"$f":"NPV(P3,R3:U3)","v":{"v":347.99232604148267,"d":"347.992326041483000"}},{"v":2.5,"d":"2.500000000000000"},"v[]",1000,666.66666,333.33,12.2768416]
[null,1,10,100,10000,1,null,{"$f":"FV(B4,C4,D4,E4,F4)","v":{"v":-10444600,"d":"-10444600.000000000000000"}},{"$nulls":6},{"$f":"NPV(P4,R4:U4)","v":{"v":74.37424333770608,"d":"74.374243337706100"}},{"v":12.33333,"d":"12.333330000000000"},"v[]",1000,0,-900,-7777.5765]
[null,2,12,120,12000,0,null,{"v":-6409178400,"d":"-6409178400.000000000000000"},{"$nulls":6},{"$f":"NPV(P5,R5:X5)","v":{"v":11342283.4233124,"d":"11342283.423312400000000"}},{"v":0.05,"d":"0.050000000000000"},"v[]",200000,300000.55,400000,1000000,6000000,7000000,-300000]
[null,2,12,120,12000,1,null,{"v":-6472951200,"d":"-6472951200.000000000000000"}]
[null,{"$f":"2/3","v":0.6666666666666666},23,133.33,34307,0,null,{"v":-4369465978.793723,"d":"-4369465978.793720000000000"}]
[null,{"$f":"2/3","v":0.6666666666666666},23,133.33,34307,1,null,{"v":-4386348826.019343,"d":"-4386348826.019340000000000"}]
[null,0,1,100,2300,0,null,{"v":-2400,"d":"-2400.000000000000000"}]
[null,0,1,100,2300,1,null,{"v":-2400,"d":"-2400.000000000000000"}]
[null,0,12,120,12000,0,null,{"v":-13440,"d":"-13440.000000000000000"}]
[null,0,12,120,12000,1,null,{"v":-13440,"d":"-13440.000000000000000"}]
[null,2.3333,4,334.5,14323.45,0,null,{"v":-1785811.0268780407,"d":"-1785811.026878040000000"}]
[null,2.3333,4,334.5,14323.45,1,null,{"v":-1826771.1713472628,"d":"-1826771.171347260000000"}]
[10000,1,10,100,null,0,null,null,{"$f":"PV(B15,C15,D15,A15,F15)","v":{"v":-109.66796875,"d":"-109.667968750000000"}}]
[10000,1,10,100,null,1,null,null,{"$f":"PV(B16,C16,D16,A16,F16)","v":{"v":-209.5703125,"d":"-209.570312500000000"}}]
[333891.23,2.95,13,13000,null,0,null,null,{"$f":"PV(B17,C17,D17,A17,F17)","v":{"v":-4406.785442944962,"d":"-4406.785442944960000"}}]
[333891.23,2.95,13,13000,null,1,null,null,{"$f":"PV(B18,C18,D18,A18,F18)","v":{"v":-17406.78521481564,"d":"-17406.785214815600000"}}]
[null,2.95,13,13000,{"v":-4406.785442944962,"d":"-4406.785442944960000"},0,null,{"$f":"FV(B19,C19,D19,E19,F19)","v":{"v":333891.2300109863,"d":"333891.230010986000000"}}]
[null,2.95,13,13000,{"v":-17406.78521481564,"d":"-17406.785214815600000"},1,null,{"$f":"FV(B20,C20,D20,E20,F20)","v":{"v":333891.23010253906,"d":"333891.230102539000000"}}]
[10000,1,10,null,-109.66796875,0,{"$nulls":3},{"$f":"PMT(B21,C21,E21,A21,F21)","v":{"v":100,"d":"100.000000000000000"}}]
[10000,1,10,null,-209.5703125,1,{"$nulls":3},{"$f":"PMT(B22,C22,E22,A22,F22)","v":{"v":100,"d":"100.000000000000000"}}]
[10000,1,null,100,-109.66796875,0,{"$nulls":4},{"$f":"NPER(B23,D23,E23,A23,F23)","v":{"v":10,"d":"10.000000000000000"}}]
[10000,1,null,100,-209.5703125,1]
[{"$nulls":5},0]
[{"$nulls":5},1]
[{"$nulls":5},0]
[{"$nulls":5},1]
[{"$nulls":5},0]
[{"$nulls":5},1]
[{"$nulls":5},0]
[{"$nulls":5},1]
[{"$nulls":5},0]
[{"$nulls":5},1]

{"sheet":"StatsLibTests","index":2,"n_rows":19,"n_cols":9,"rows_kept":19}
[null,{"v":1,"d":"1.00000000000"},{"v":1,"d":"1.00000000000"},{"v":0,"d":"0.00000000000"},{"v":1,"d":"1.00000000000"},{"v":123.12,"d":"123.12000000000"},{"$f":"-1*B1","v":{"v":-1,"d":"-1.00000000000"}}]
[null,{"v":2,"d":"2.00000000000"},{"v":1,"d":"1.00000000000"},{"v":0,"d":"0.00000000000"},{"v":2,"d":"2.00000000000"},{"v":33.3333,"d":"33.33330000000"},{"$f":"-1*B2","v":{"v":-2,"d":"-2.00000000000"}}]
[null,{"v":3,"d":"3.00000000000"},{"v":1,"d":"1.00000000000"},{"v":0,"d":"0.00000000000"},{"v":1,"d":"1.00000000000"},{"$f":"2/3","v":{"v":0.6666666666666666,"d":"0.66666666667"}},{"v":-3,"d":"-3.00000000000"}]
[null,{"v":4,"d":"4.00000000000"},{"v":1,"d":"1.00000000000"},{"v":0,"d":"0.00000000000"},{"v":2,"d":"2.00000000000"},{"v":5.37828,"d":"5.37828000000"},{"v":-4,"d":"-4.00000000000"}]
[null,{"v":5,"d":"5.00000000000"},{"v":1,"d":"1.00000000000"},{"v":0,"d":"0.00000000000"},{"v":1,"d":"1.00000000000"},{"v":0.999,"d":"0.99900000000"},{"v":-5,"d":"-5.00000000000"}]
[null,{"v":6,"d":"6.00000000000"},{"v":1,"d":"1.00000000000"},{"v":0,"d":"0.00000000000"},{"v":2,"d":"2.00000000000"},null,{"v":-6,"d":"-6.00000000000"}]
[null,{"v":7,"d":"7.00000000000"},{"v":1,"d":"1.00000000000"},{"v":0,"d":"0.00000000000"},{"v":1,"d":"1.00000000000"},null,{"v":-7,"d":"-7.00000000000"}]
[null,{"v":8,"d":"8.00000000000"},{"v":1,"d":"1.00000000000"},{"v":0,"d":"0.00000000000"},{"v":2,"d":"2.00000000000"},null,{"v":-8,"d":"-8.00000000000"}]
[null,{"v":9,"d":"9.00000000000"},{"v":1,"d":"1.00000000000"},{"v":0,"d":"0.00000000000"},{"v":1,"d":"1.00000000000"},null,{"v":-9,"d":"-9.00000000000"}]
[null,{"v":10,"d":"10.00000000000"},{"v":1,"d":"1.00000000000"},{"v":0,"d":"0.00000000000"},{"v":2,"d":"2.00000000000"},null,{"v":-10,"d":"-10.00000000000"}]
[]
["avedev",{"$f":"AVEDEV(B1:B10)","v":{"v":2.5,"d":"2.50000000000"}},{"v":0,"d":"0.00000000000"},{"v":0,"d":"0.00000000000"},{"v":0.5,"d":"0.50000000000"},{"v":36.421760533333334,"d":"36.42176053333"},{"v":2.5,"d":"2.50000000000"}]
["stdev",{"$f":"STDEV(B1:B10)","v":{"v":3.0276503540974917,"d":"3.02765035410"}},{"v":0,"d":"0.00000000000"},{"v":0,"d":"0.00000000000"},{"v":0.5270462766947299,"d":"0.52704627669"},{"v":52.33006233652096,"d":"52.33006233652"},{"v":3.0276503540974917,"d":"3.02765035410"}]
["devsq",{"$f":"DEVSQ(B1:B10)","v":{"v":82.5,"d":"82.50000000000"}},{"$f":"DEVSQ(C1:C10)","v":{"v":0,"d":"0.00000000000"}},{"$f":"DEVSQ(D1:D10)","v":{"v":0,"d":"0.00000000000"}},{"$f":"DEVSQ(E1:E10)","v":{"v":2.5,"d":"2.50000000000"}},{"$f":"DEVSQ(F1:F5)","v":{"v":10953.741696576677,"d":"10953.74169657670"}},{"$f":"DEVSQ(G1:G10)","v":{"v":82.5,"d":"82.50000000000"}}]
["large",{"$f":"LARGE(B1:B10,3)","v":{"v":8,"d":"8.00000000000"}},{"v":1,"d":"1.00000000000"},{"v":0,"d":"0.00000000000"},{"v":2,"d":"2.00000000000"},{"v":5.37828,"d":"5.37828000000"},{"v":-3,"d":"-3.00000000000"}]
["small",{"$f":"SMALL(B1:B10,3)","v":{"v":3,"d":"3.00000000000"}},{"v":1,"d":"1.00000000000"},{"v":0,"d":"0.00000000000"},{"v":1,"d":"1.00000000000"},{"v":5.37828,"d":"5.37828000000"},{"v":-8,"d":"-8.00000000000"}]
["median",{"$f":"MEDIAN(B1:B10)","v":{"v":5.5,"d":"5.50000000000"}},{"v":1,"d":"1.00000000000"},{"v":0,"d":"0.00000000000"},{"v":1.5,"d":"1.50000000000"},{"v":5.37828,"d":"5.37828000000"},{"v":-5.5,"d":"-5.50000000000"},{"$f":"MEDIAN(B1:B9)","v":{"v":5,"d":"5.00000000000"}},{"$f":"MEDIAN(G2:G10)","v":{"v":-6,"d":"-6.00000000000"}}]
["mode",{"$f":"MODE(B1:B10)","v":{"$error":"#N/A"}},{"v":1,"d":"1.00000000000"},{"v":0,"d":"0.00000000000"},{"v":1,"d":"1.00000000000"},{"$error":"#N/A"},{"$error":"#N/A"},{"$f":"MODE(B1:D4,D5)","v":{"v":1,"d":"1.00000000000"}}]
["var",{"$f":"VAR(B1:B10)","v":{"v":9.166666666666666,"d":"9.16666666667"}},{"v":0,"d":"0.00000000000"},{"v":0,"d":"0.00000000000"},{"v":0.2777777777777778,"d":"0.27777777778"},{"v":2738.4354241441692,"d":"2738.43542414417"},{"v":9.166666666666666,"d":"9.16666666667"}]

{"sheet":"misc","index":3,"n_rows":18,"n_cols":6,"rows_kept":18}
["string",{"$f":"\"1\"","v":"1"},1,true,{"$f":"F1","v":0}]
[{"$f":"\"TRUE\"","v":"TRUE"},{"$f":"\"2.3\"","v":"2.3"},123.23,false,{"$f":"SUM(1,2)","v":3},1]
[{"$f":"\"FALSE\"","v":"FALSE"},{"$f":"B2","v":"2.3"},-12,{"$f":"D1","v":true}]
[]
[null,null,12]
[{"$nulls":4},{"$f":"CONCATENATE(E2,\"1\")","v":"31"}]
[]
[{"$f":"LARGE(C4:C7,2)","v":{"$error":"#NUM!"}},{"$nulls":3},{"$f":"F1","v":0}]
[]
[{"$nulls":4},{"$f":"MAX(E8,-1)","v":0}]
[]
[{"$f":"\"TRUE\"","v":"TRUE"}]
[{"$f":"AVERAGEA(\"TRUE\",1)","v":{"$error":"#VALUE!"}}]
[{"$f":"AVERAGEA(A12,2)","v":1}]
[]
["abc",{"$f":"C16","v":0}]
[]
[{"$f":"AVERAGEA(\"1\",1,A16,B16)","v":0.5}]